Subject: [ADD]اضافة بيانات و مؤشرات اخرى في لوحة المؤشرات
Author: Rami Ben Hadj Ahmed
Committer: Rami Ben Hadj Ahmed

Date Level Type Message
2019-03-14 18:34:26 INFO runbot init Init build environment
2019-03-14 18:34:36 INFO runbot test_all Start test all modules
2019-03-14 18:35:34 INFO server odoo.modules.module:515 run_unit_tests odoo.addons.base.tests.test_translate tested in 8.14s, 25627 queries
2019-03-14 18:35:39 INFO server odoo.modules.loading:234 load_module_graph 1 modules loaded in 56.95s, 48221 queries
2019-03-14 18:36:02 INFO server odoo.modules.module:515 run_unit_tests odoo.addons.base_import.tests.test_base_import tested in 9.62s, 232 queries
2019-03-14 18:36:43 INFO server odoo.modules.module:515 run_unit_tests odoo.addons.mail.tests.test_mail_gateway tested in 5.72s, 4915 queries
2019-03-14 18:37:13 INFO server odoo.modules.module:515 run_unit_tests odoo.addons.calendar.tests.test_calendar tested in 7.40s, 5826 queries
2019-03-14 18:37:26 INFO server odoo.modules.module:515 run_unit_tests odoo.addons.event.tests.test_event_flow tested in 5.65s, 4300 queries
2019-03-14 18:38:33 INFO server odoo.modules.module:515 run_unit_tests odoo.addons.product.tests.test_variants tested in 7.90s, 7979 queries
2019-03-14 18:39:47 INFO server odoo.modules.module:515 run_unit_tests odoo.addons.crm.tests.test_crm_lead tested in 9.50s, 6720 queries
2019-03-14 18:39:56 INFO server odoo.modules.module:515 run_unit_tests odoo.addons.crm.tests.test_lead2opportunity tested in 9.38s, 6739 queries
2019-03-14 18:40:26 INFO server odoo.modules.module:515 run_unit_tests odoo.addons.hr_holidays.tests.test_holidays_flow tested in 11.55s, 5544 queries
2019-03-14 18:41:15 INFO server odoo.modules.module:515 run_unit_tests odoo.addons.project.tests.test_access_rights tested in 7.68s, 5163 queries
2019-03-14 18:41:25 INFO server odoo.modules.module:515 run_unit_tests odoo.addons.project.tests.test_project_flow tested in 5.14s, 3569 queries
2019-03-14 18:42:47 INFO server odoo.modules.module:515 run_unit_tests odoo.addons.hr_payroll.tests.test_payslip_flow tested in 6.15s, 1120 queries
2019-03-14 18:43:21 INFO server odoo.modules.module:515 run_unit_tests odoo.addons.survey.tests.test_survey tested in 14.93s, 11745 queries
2019-03-14 18:44:24 INFO server odoo.modules.module:515 run_unit_tests odoo.addons.purchase_request.tests.test_purchase_flow tested in 10.61s, 3386 queries
2019-03-14 18:44:54 INFO server odoo.modules.module:515 run_unit_tests odoo.addons.website_forum.tests.test_forum tested in 6.00s, 4670 queries
2019-03-14 18:45:40 INFO server odoo.modules.module:515 run_unit_tests odoo.addons.hr_attendance_extend.tests.test_authorization_flow tested in 5.68s, 1302 queries
2019-03-14 18:46:08 INFO server odoo.modules.module:515 run_unit_tests odoo.addons.hr_deputation.tests.test_deputation_flow tested in 11.90s, 4056 queries
2019-03-14 18:46:39 INFO server odoo.modules.module:515 run_unit_tests odoo.addons.hr_holidays_extend.tests.test_holidays_flow tested in 15.07s, 6961 queries
2019-03-14 18:47:10 ERROR server odoo.addons.hr_training.tests.test_training_constrains:474 write ERROR
2019-03-14 18:47:10 ERROR server odoo.addons.hr_training.tests.test_training_constrains:474 write ERROR: test_training_constrains (odoo.addons.hr_training.tests.test_training_constrains.TestTrainingConstrains)
2019-03-14 18:47:10 ERROR server odoo.addons.hr_training.tests.test_training_constrains:474 write ` Test Training constraint.
2019-03-14 18:47:10 ERROR server odoo.addons.hr_training.tests.test_training_constrains:474 write Traceback (most recent call last):
2019-03-14 18:47:10 ERROR server odoo.addons.hr_training.tests.test_training_constrains:474 write ` File "/mnt/vdb/odoo/addons_runbot/runbot/static/build/09191-1260-221845/addons/hr_training/tests/test_training_constrains.py", line 76, in test_training_constrains
2019-03-14 18:47:10 ERROR server odoo.addons.hr_training.tests.test_training_constrains:474 write ` 'published': True})
2019-03-14 18:47:10 ERROR server odoo.addons.hr_training.tests.test_training_constrains:474 write ` File "/mnt/vdb/odoo/addons_runbot/runbot/static/build/09191-1260-221845/addons/hr_training/models/hr_training.py", line 50, in create
2019-03-14 18:47:10 ERROR server odoo.addons.hr_training.tests.test_training_constrains:474 write ` return super(HrTraining, self).create(vals)
2019-03-14 18:47:10 ERROR server odoo.addons.hr_training.tests.test_training_constrains:474 write ` File "/opt/odoo/odoo11/addons/mail/models/mail_thread.py", line 236, in create
2019-03-14 18:47:10 ERROR server odoo.addons.hr_training.tests.test_training_constrains:474 write ` thread = super(MailThread, self).create(values)
2019-03-14 18:47:10 ERROR server odoo.addons.hr_training.tests.test_training_constrains:474 write ` File "/mnt/vdb/odoo/addons_runbot/runbot/static/build/09191-1260-221845/addons/popup_reminder/models/popup_reminder.py", line 32, in create
2019-03-14 18:47:10 ERROR server odoo.addons.hr_training.tests.test_training_constrains:474 write ` record_id = create_original(self, vals)
2019-03-14 18:47:10 ERROR server odoo.addons.hr_training.tests.test_training_constrains:474 write ` File "/opt/odoo/odoo11/odoo/models.py", line 3372, in create
2019-03-14 18:47:10 ERROR server odoo.addons.hr_training.tests.test_training_constrains:474 write ` record = self.browse(self._create(old_vals))
2019-03-14 18:47:10 ERROR server odoo.addons.hr_training.tests.test_training_constrains:474 write ` File "/opt/odoo/odoo11/odoo/models.py", line 3525, in _create
2019-03-14 18:47:10 ERROR server odoo.addons.hr_training.tests.test_training_constrains:474 write ` self._validate_fields(vals)
2019-03-14 18:47:10 ERROR server odoo.addons.hr_training.tests.test_training_constrains:474 write ` File "/opt/odoo/odoo11/odoo/models.py", line 1036, in _validate_fields
2019-03-14 18:47:10 ERROR server odoo.addons.hr_training.tests.test_training_constrains:474 write ` check(self)
2019-03-14 18:47:10 ERROR server odoo.addons.hr_training.tests.test_training_constrains:474 write ` File "/mnt/vdb/odoo/addons_runbot/runbot/static/build/09191-1260-221845/addons/hr_training/models/hr_training.py", line 80, in _check_order_chek_date
2019-03-14 18:47:10 ERROR server odoo.addons.hr_training.tests.test_training_constrains:474 write ` raise ValidationError(_(" تاريخ التدريب يجب أن يكون أكبر من تاريخ اليوم"))
2019-03-14 18:47:10 ERROR server odoo.addons.hr_training.tests.test_training_constrains:474 write ` odoo.exceptions.ValidationError: (' تاريخ التدريب يجب أن يكون أكبر من تاريخ اليوم', None)
2019-03-14 18:47:10 ERROR server odoo.addons.hr_training.tests.test_training_constrains:474 write FAILED
2019-03-14 18:47:10 ERROR server odoo.modules.module:518 run_unit_tests Module hr_training: 0 failures, 1 errors
2019-03-14 18:47:20 INFO server odoo.modules.module:515 run_unit_tests odoo.addons.hr_training.tests.test_training_flow tested in 10.56s, 4683 queries
2019-03-14 18:47:50 INFO server odoo.modules.module:515 run_unit_tests odoo.addons.project_maintenance.tests.test_project_maintenance_flow tested in 10.51s, 6309 queries
2019-03-14 18:50:17 INFO server odoo.modules.loading:234 load_module_graph 169 modules loaded in 874.51s, 171805 queries
2019-03-14 18:50:37 INFO server odoo.modules.loading:234 load_module_graph 173 modules loaded in 19.50s, 11 queries
2019-03-14 18:50:38 ERROR server odoo.modules.loading:471 load_modules At least one test failed when loading the modules.
2019-03-14 18:50:48 INFO server odoo.modules.module:515 run_unit_tests odoo.addons.base.tests.test_reports tested in 9.02s, 1054 queries
2019-03-14 18:51:00 INFO server odoo.modules.module:515 run_unit_tests odoo.addons.account.tests.test_account_invoice_rounding tested in 5.96s, 4193 queries
2019-03-14 18:51:24 INFO server odoo.modules.module:515 run_unit_tests odoo.addons.account.tests.test_payment tested in 18.63s, 14432 queries
2019-03-14 18:52:13 INFO server odoo.modules.module:515 run_unit_tests odoo.addons.account.tests.test_reconciliation tested in 47.13s, 37267 queries
2019-03-14 18:52:23 INFO server odoo.modules.module:515 run_unit_tests odoo.addons.account.tests.test_tax tested in 7.41s, 5405 queries
2019-03-14 18:52:27 INFO server odoo.addons.website.tests.test_crawl:73 test_10_crawl_public public crawled 1 urls in 4.28s 410 queries, 4.281s 410.00q per request,
2019-03-14 18:53:00 INFO server odoo.addons.website.tests.test_crawl:83 test_20_crawl_demo demo crawled 60 urls in 32.26s 24091 queries, 0.538s 401.52q per request
2019-03-14 18:53:35 INFO server odoo.addons.website.tests.test_crawl:93 test_30_crawl_admin admin crawled 76 urls in 35.21s 27495 queries, 0.463s 361.78q per request
2019-03-14 18:53:35 INFO server odoo.modules.module:515 run_unit_tests odoo.addons.website.tests.test_crawl tested in 71.82s, 52018 queries
2019-03-14 18:53:41 INFO runbot run Start running build 09191-1260-221845
2019-03-14 18:53:43 INFO server odoo.modules.loading:234 load_module_graph 1 modules loaded in 0.28s, 0 queries
2019-03-14 18:53:44 INFO server odoo.modules.loading:234 load_module_graph 173 modules loaded in 1.07s, 0 queries
2019-03-14 19:04:53 ERROR server odoo.osv.expression:911 parse Non-stored field dms.folder.is_favorite cannot be searched.
2019-03-14 19:04:54 ERROR server odoo.osv.expression:911 parse Non-stored field dms.folder.is_favorite cannot be searched.
2019-03-14 19:05:15 ERROR server odoo.osv.expression:911 parse Non-stored field dms.folder.is_favorite cannot be searched.
2019-03-14 21:58:45 ERROR server odoo.osv.expression:911 parse Non-stored field dms.folder.is_favorite cannot be searched.
2019-03-15 08:47:20 ERROR server odoo.osv.expression:911 parse Non-stored field dms.folder.is_favorite cannot be searched.
2019-03-15 08:47:26 ERROR server odoo.osv.expression:911 parse Non-stored field dms.folder.is_favorite cannot be searched.
2019-03-15 08:47:31 ERROR server odoo.osv.expression:911 parse Non-stored field dms.folder.is_favorite cannot be searched.
2019-03-15 13:58:14 ERROR server odoo.osv.expression:911 parse Non-stored field dms.folder.is_favorite cannot be searched.
2019-03-15 13:58:25 ERROR server odoo.osv.expression:911 parse Non-stored field dms.folder.is_favorite cannot be searched.
2019-03-15 15:46:32 ERROR server odoo.osv.expression:911 parse Non-stored field dms.folder.is_favorite cannot be searched.
2019-03-15 15:46:32 WARNING server odoo.models:2586 read dms.folder.read() with unknown field 'permission_create'
2019-03-15 16:08:50 ERROR server odoo.osv.expression:911 parse Non-stored field dms.folder.is_favorite cannot be searched.
2019-03-15 16:08:50 WARNING server odoo.models:2586 read dms.folder.read() with unknown field 'permission_create'
2019-03-15 16:09:59 ERROR server odoo.osv.expression:911 parse Non-stored field dms.folder.is_favorite cannot be searched.
2019-03-15 16:09:59 WARNING server odoo.models:2586 read dms.folder.read() with unknown field 'permission_create'
2019-03-15 16:10:49 ERROR server odoo.osv.expression:911 parse Non-stored field dms.folder.is_favorite cannot be searched.
2019-03-15 16:10:49 WARNING server odoo.models:2586 read dms.folder.read() with unknown field 'permission_create'
2019-03-15 16:10:52 ERROR server odoo.osv.expression:911 parse Non-stored field dms.folder.is_favorite cannot be searched.
2019-03-15 16:10:52 WARNING server odoo.models:2586 read dms.folder.read() with unknown field 'permission_create'
2019-03-15 16:10:53 ERROR server odoo.osv.expression:911 parse Non-stored field dms.folder.is_favorite cannot be searched.
2019-03-15 16:10:53 WARNING server odoo.models:2586 read dms.folder.read() with unknown field 'permission_create'
2019-03-15 16:20:06 ERROR server odoo.addons.website.models.ir_http:206 _handle_exception
500 Internal Server Error:

Traceback (most recent call last):
  File "/opt/odoo/odoo11/odoo/addons/base/ir/ir_http.py", line 208, in _dispatch
    result = request.dispatch()
  File "/opt/odoo/odoo11/odoo/http.py", line 829, in dispatch
    r = self._call_function(**self.params)
  File "/opt/odoo/odoo11/odoo/http.py", line 342, in _call_function
    return checked_call(self.db, *args, **kwargs)
  File "/opt/odoo/odoo11/odoo/service/model.py", line 97, in wrapper
    return f(dbname, *args, **kwargs)
  File "/opt/odoo/odoo11/odoo/http.py", line 335, in checked_call
    result = self.endpoint(*a, **kw)
  File "/opt/odoo/odoo11/odoo/http.py", line 936, in __call__
    return self.method(*args, **kw)
  File "/opt/odoo/odoo11/odoo/http.py", line 515, in response_wrap
    response = f(*args, **kw)
TypeError: details_salary_new_month() got an unexpected keyword argument 'debug'
2019-03-15 22:11:57 INFO runbot _ask_kill Killing build 09191-1260-221845, requested by Administrator (user #1)
2019-03-15 22:12:29 INFO runbot kill Kill build 09191-1260-221845