Subject: [FIX]Add config for this feature
Author: iboussetta
Committer: iboussetta

Date Level Type Message
2019-03-14 09:28:45 INFO runbot rebuild Rebuild initiated by Public user
2019-03-14 09:28:49 INFO runbot init Init build environment
2019-03-14 09:29:04 INFO runbot test_all Start test all modules
2019-03-14 09:30:02 INFO server odoo.modules.module:515 run_unit_tests odoo.addons.base.tests.test_translate tested in 9.21s, 25627 queries
2019-03-14 09:30:06 INFO server odoo.modules.loading:234 load_module_graph 1 modules loaded in 55.56s, 48224 queries
2019-03-14 09:30:30 INFO server odoo.modules.module:515 run_unit_tests odoo.addons.base_import.tests.test_base_import tested in 10.92s, 232 queries
2019-03-14 09:31:31 INFO server odoo.modules.module:515 run_unit_tests odoo.addons.calendar.tests.test_calendar tested in 5.93s, 5839 queries
2019-03-14 09:32:45 INFO server odoo.modules.module:515 run_unit_tests odoo.addons.product.tests.test_variants tested in 7.78s, 7979 queries
2019-03-14 09:33:48 INFO server odoo.modules.module:515 run_unit_tests odoo.addons.crm.tests.test_crm_lead tested in 7.75s, 6726 queries
2019-03-14 09:33:56 INFO server odoo.modules.module:515 run_unit_tests odoo.addons.crm.tests.test_lead2opportunity tested in 7.51s, 6741 queries
2019-03-14 09:34:23 INFO server odoo.modules.module:515 run_unit_tests odoo.addons.hr_holidays.tests.test_holidays_flow tested in 11.02s, 5544 queries
2019-03-14 09:35:07 INFO server odoo.modules.module:515 run_unit_tests odoo.addons.project.tests.test_access_rights tested in 6.76s, 5163 queries
2019-03-14 09:35:20 ERROR server odoo.addons.user_profile.tests.test_user_profile:474 write FAIL
2019-03-14 09:35:20 ERROR server odoo.addons.user_profile.tests.test_user_profile:474 write FAIL: test_user_profile (odoo.addons.user_profile.tests.test_user_profile.UserProfileCommon)
2019-03-14 09:35:20 ERROR server odoo.addons.user_profile.tests.test_user_profile:474 write ` Checking the process of create user sing profile.
2019-03-14 09:35:20 ERROR server odoo.addons.user_profile.tests.test_user_profile:474 write Traceback (most recent call last):
2019-03-14 09:35:20 ERROR server odoo.addons.user_profile.tests.test_user_profile:474 write ` File "/mnt/vdb/odoo/addons_runbot/runbot/static/build/09166-1225-997516/addons/user_profile/tests/test_user_profile.py", line 45, in test_user_profile
2019-03-14 09:35:20 ERROR server odoo.addons.user_profile.tests.test_user_profile:474 write ` self.assertEqual(len(emails), 1, "System should send mail to simple@hadooc.com")
2019-03-14 09:35:20 ERROR server odoo.addons.user_profile.tests.test_user_profile:474 write ` AssertionError: 0 != 1 : System should send mail to simple@hadooc.com
2019-03-14 09:35:20 ERROR server odoo.addons.user_profile.tests.test_user_profile:474 write FAILED
2019-03-14 09:35:20 ERROR server odoo.modules.module:518 run_unit_tests Module user_profile: 1 failures, 0 errors
2019-03-14 09:36:41 INFO server odoo.modules.module:515 run_unit_tests odoo.addons.hr_payroll.tests.test_payslip_flow tested in 6.51s, 1120 queries
2019-03-14 09:37:14 INFO server odoo.modules.module:515 run_unit_tests odoo.addons.survey.tests.test_survey tested in 14.90s, 11746 queries
2019-03-14 09:38:16 INFO server odoo.modules.module:515 run_unit_tests odoo.addons.purchase_request.tests.test_purchase_flow tested in 10.45s, 3386 queries
2019-03-14 09:38:45 INFO server odoo.modules.module:515 run_unit_tests odoo.addons.website_forum.tests.test_forum tested in 5.96s, 4712 queries
2019-03-14 09:39:31 INFO server odoo.modules.module:515 run_unit_tests odoo.addons.hr_attendance_extend.tests.test_authorization_flow tested in 5.30s, 1302 queries
2019-03-14 09:39:58 INFO server odoo.modules.module:515 run_unit_tests odoo.addons.hr_deputation.tests.test_deputation_flow tested in 11.56s, 4024 queries
2019-03-14 09:40:29 INFO server odoo.modules.module:515 run_unit_tests odoo.addons.hr_holidays_extend.tests.test_holidays_flow tested in 15.15s, 6961 queries
2019-03-14 09:40:59 ERROR server odoo.addons.hr_training.tests.test_training_constrains:474 write ERROR
2019-03-14 09:40:59 ERROR server odoo.addons.hr_training.tests.test_training_constrains:474 write ERROR: test_training_constrains (odoo.addons.hr_training.tests.test_training_constrains.TestTrainingConstrains)
2019-03-14 09:40:59 ERROR server odoo.addons.hr_training.tests.test_training_constrains:474 write ` Test Training constraint.
2019-03-14 09:40:59 ERROR server odoo.addons.hr_training.tests.test_training_constrains:474 write Traceback (most recent call last):
2019-03-14 09:40:59 ERROR server odoo.addons.hr_training.tests.test_training_constrains:474 write ` File "/mnt/vdb/odoo/addons_runbot/runbot/static/build/09166-1225-997516/addons/hr_training/tests/test_training_constrains.py", line 76, in test_training_constrains
2019-03-14 09:40:59 ERROR server odoo.addons.hr_training.tests.test_training_constrains:474 write ` 'published': True})
2019-03-14 09:40:59 ERROR server odoo.addons.hr_training.tests.test_training_constrains:474 write ` File "/mnt/vdb/odoo/addons_runbot/runbot/static/build/09166-1225-997516/addons/hr_training/models/hr_training.py", line 50, in create
2019-03-14 09:40:59 ERROR server odoo.addons.hr_training.tests.test_training_constrains:474 write ` return super(HrTraining, self).create(vals)
2019-03-14 09:40:59 ERROR server odoo.addons.hr_training.tests.test_training_constrains:474 write ` File "/opt/odoo/odoo11/addons/mail/models/mail_thread.py", line 236, in create
2019-03-14 09:40:59 ERROR server odoo.addons.hr_training.tests.test_training_constrains:474 write ` thread = super(MailThread, self).create(values)
2019-03-14 09:40:59 ERROR server odoo.addons.hr_training.tests.test_training_constrains:474 write ` File "/mnt/vdb/odoo/addons_runbot/runbot/static/build/09166-1225-997516/addons/popup_reminder/models/popup_reminder.py", line 32, in create
2019-03-14 09:40:59 ERROR server odoo.addons.hr_training.tests.test_training_constrains:474 write ` record_id = create_original(self, vals)
2019-03-14 09:40:59 ERROR server odoo.addons.hr_training.tests.test_training_constrains:474 write ` File "/opt/odoo/odoo11/odoo/models.py", line 3372, in create
2019-03-14 09:40:59 ERROR server odoo.addons.hr_training.tests.test_training_constrains:474 write ` record = self.browse(self._create(old_vals))
2019-03-14 09:40:59 ERROR server odoo.addons.hr_training.tests.test_training_constrains:474 write ` File "/opt/odoo/odoo11/odoo/models.py", line 3525, in _create
2019-03-14 09:40:59 ERROR server odoo.addons.hr_training.tests.test_training_constrains:474 write ` self._validate_fields(vals)
2019-03-14 09:40:59 ERROR server odoo.addons.hr_training.tests.test_training_constrains:474 write ` File "/opt/odoo/odoo11/odoo/models.py", line 1036, in _validate_fields
2019-03-14 09:40:59 ERROR server odoo.addons.hr_training.tests.test_training_constrains:474 write ` check(self)
2019-03-14 09:40:59 ERROR server odoo.addons.hr_training.tests.test_training_constrains:474 write ` File "/mnt/vdb/odoo/addons_runbot/runbot/static/build/09166-1225-997516/addons/hr_training/models/hr_training.py", line 80, in _check_order_chek_date
2019-03-14 09:40:59 ERROR server odoo.addons.hr_training.tests.test_training_constrains:474 write ` raise ValidationError(_(" تاريخ التدريب يجب أن يكون أكبر من تاريخ اليوم"))
2019-03-14 09:40:59 ERROR server odoo.addons.hr_training.tests.test_training_constrains:474 write ` odoo.exceptions.ValidationError: (' تاريخ التدريب يجب أن يكون أكبر من تاريخ اليوم', None)
2019-03-14 09:40:59 ERROR server odoo.addons.hr_training.tests.test_training_constrains:474 write FAILED
2019-03-14 09:40:59 ERROR server odoo.modules.module:518 run_unit_tests Module hr_training: 0 failures, 1 errors
2019-03-14 09:41:10 INFO server odoo.modules.module:515 run_unit_tests odoo.addons.hr_training.tests.test_training_flow tested in 11.01s, 4683 queries
2019-03-14 09:41:39 INFO server odoo.modules.module:515 run_unit_tests odoo.addons.project_maintenance.tests.test_project_maintenance_flow tested in 10.69s, 6309 queries
2019-03-14 09:42:20 INFO server odoo.modules.module:515 run_unit_tests odoo.addons.hr_deputation_delegacy.tests.test_deputation_delegacy tested in 5.16s, 1765 queries
2019-03-14 09:44:06 INFO server odoo.modules.loading:234 load_module_graph 169 modules loaded in 836.15s, 172231 queries
2019-03-14 09:44:27 INFO server odoo.modules.loading:234 load_module_graph 173 modules loaded in 20.50s, 11 queries
2019-03-14 09:44:28 ERROR server odoo.modules.loading:471 load_modules At least one test failed when loading the modules.
2019-03-14 09:44:38 INFO server odoo.modules.module:515 run_unit_tests odoo.addons.base.tests.test_reports tested in 9.46s, 1055 queries
2019-03-14 09:44:51 INFO server odoo.modules.module:515 run_unit_tests odoo.addons.account.tests.test_account_invoice_rounding tested in 5.96s, 4193 queries
2019-03-14 09:45:15 INFO server odoo.modules.module:515 run_unit_tests odoo.addons.account.tests.test_payment tested in 18.45s, 14516 queries
2019-03-14 09:46:03 INFO server odoo.modules.module:515 run_unit_tests odoo.addons.account.tests.test_reconciliation tested in 46.18s, 37432 queries
2019-03-14 09:46:13 INFO server odoo.modules.module:515 run_unit_tests odoo.addons.account.tests.test_tax tested in 7.22s, 5440 queries
2019-03-14 09:46:18 INFO server odoo.addons.website.tests.test_crawl:73 test_10_crawl_public public crawled 1 urls in 4.47s 410 queries, 4.473s 410.00q per request,
2019-03-14 09:46:50 INFO server odoo.addons.website.tests.test_crawl:83 test_20_crawl_demo demo crawled 60 urls in 31.95s 24091 queries, 0.532s 401.52q per request
2019-03-14 09:47:25 INFO server odoo.addons.website.tests.test_crawl:93 test_30_crawl_admin admin crawled 76 urls in 35.81s 27495 queries, 0.471s 361.78q per request
2019-03-14 09:47:25 INFO server odoo.modules.module:515 run_unit_tests odoo.addons.website.tests.test_crawl tested in 72.31s, 52018 queries
2019-03-14 09:47:29 INFO runbot run Start running build 09166-1225-997516
2019-03-14 09:47:31 INFO server odoo.modules.loading:234 load_module_graph 1 modules loaded in 0.27s, 0 queries
2019-03-14 09:47:33 INFO server odoo.modules.loading:234 load_module_graph 173 modules loaded in 1.09s, 0 queries
2019-03-15 07:39:54 INFO runbot _ask_kill Killing build 09166-1225-997516, requested by Intissar (user #6)
2019-03-15 07:40:34 INFO runbot kill Kill build 09166-1225-997516