Subject: Merge branch '11.18.2' into '11.18'
Author: Intissar Boussetta
Committer: Intissar Boussetta

Date Level Type Message
2019-03-13 17:59:22 INFO runbot init Init build environment
2019-03-13 17:59:31 INFO runbot test_all Start test all modules
2019-03-13 18:01:08 INFO server odoo.modules.module:515 run_unit_tests odoo.addons.base.tests.test_base tested in 7.54s, 2730 queries
2019-03-13 18:01:17 INFO server odoo.modules.module:515 run_unit_tests odoo.addons.base.tests.test_expression tested in 8.31s, 5605 queries
2019-03-13 18:01:27 INFO server odoo.modules.module:515 run_unit_tests odoo.addons.base.tests.test_ir_actions tested in 9.41s, 2330 queries
2019-03-13 18:01:38 INFO server odoo.modules.module:515 run_unit_tests odoo.addons.base.tests.test_orm tested in 5.57s, 1990 queries
2019-03-13 18:02:11 INFO server odoo.modules.module:515 run_unit_tests odoo.addons.base.tests.test_translate tested in 28.06s, 25627 queries
2019-03-13 18:02:29 INFO server odoo.modules.module:515 run_unit_tests odoo.addons.base.tests.test_views tested in 16.77s, 4809 queries
2019-03-13 18:02:29 INFO server odoo.modules.loading:234 load_module_graph 1 modules loaded in 170.70s, 48264 queries
2019-03-13 18:02:55 INFO server odoo.modules.module:515 run_unit_tests odoo.addons.resource.tests.test_resource tested in 6.96s, 1982 queries
2019-03-13 18:03:44 INFO server odoo.modules.module:515 run_unit_tests odoo.addons.base_import.tests.test_base_import tested in 35.87s, 232 queries
2019-03-13 18:05:08 INFO server odoo.modules.module:515 run_unit_tests odoo.addons.mail.tests.test_mail_channel tested in 5.12s, 1600 queries
2019-03-13 18:05:23 INFO server odoo.modules.module:515 run_unit_tests odoo.addons.mail.tests.test_mail_features tested in 14.31s, 4126 queries
2019-03-13 18:05:42 INFO server odoo.modules.module:515 run_unit_tests odoo.addons.mail.tests.test_mail_gateway tested in 14.90s, 4915 queries
2019-03-13 18:05:54 INFO server odoo.modules.module:515 run_unit_tests odoo.addons.mail.tests.test_mail_message tested in 11.80s, 3566 queries
2019-03-13 18:06:01 INFO server odoo.modules.module:515 run_unit_tests odoo.addons.mail.tests.test_mail_template tested in 7.02s, 2088 queries
2019-03-13 18:07:03 INFO server odoo.modules.module:515 run_unit_tests odoo.addons.calendar.tests.test_calendar tested in 19.66s, 5847 queries
2019-03-13 18:07:36 INFO server odoo.modules.module:515 run_unit_tests odoo.addons.event.tests.test_event_flow tested in 14.16s, 4300 queries
2019-03-13 18:10:25 INFO server odoo.modules.module:515 run_unit_tests odoo.addons.product.tests.test_product_pricelist tested in 17.08s, 622 queries
2019-03-13 18:10:46 INFO server odoo.modules.module:515 run_unit_tests odoo.addons.product.tests.test_variants tested in 20.66s, 7979 queries
2019-03-13 18:13:46 INFO server odoo.modules.module:515 run_unit_tests odoo.addons.crm.tests.test_crm_activity tested in 9.87s, 2562 queries
2019-03-13 18:14:14 INFO server odoo.modules.module:515 run_unit_tests odoo.addons.crm.tests.test_crm_lead tested in 27.40s, 6720 queries
2019-03-13 18:14:41 INFO server odoo.modules.module:515 run_unit_tests odoo.addons.crm.tests.test_lead2opportunity tested in 27.30s, 6739 queries
2019-03-13 18:16:11 INFO server odoo.modules.module:515 run_unit_tests odoo.addons.hr_holidays.tests.test_holidays_flow tested in 39.24s, 5540 queries
2019-03-13 18:16:40 INFO server odoo.modules.module:515 run_unit_tests odoo.addons.hr_recruitment.tests.test_recruitment_process tested in 5.08s, 642 queries
2019-03-13 18:18:29 INFO server odoo.modules.module:515 run_unit_tests odoo.addons.project.tests.test_access_rights tested in 21.19s, 5161 queries
2019-03-13 18:18:42 INFO server odoo.modules.module:515 run_unit_tests odoo.addons.project.tests.test_portal tested in 13.10s, 3180 queries
2019-03-13 18:18:57 INFO server odoo.modules.module:515 run_unit_tests odoo.addons.project.tests.test_project_flow tested in 14.58s, 3569 queries
2019-03-13 18:23:02 INFO server odoo.modules.module:515 run_unit_tests odoo.addons.hr_payroll.tests.test_payslip_flow tested in 23.93s, 1120 queries
2019-03-13 18:24:38 INFO server odoo.modules.module:515 run_unit_tests odoo.addons.survey.tests.test_survey tested in 45.03s, 11745 queries
2019-03-13 18:26:04 INFO server odoo.modules.module:515 run_unit_tests odoo.addons.hr_overtime.tests.test_overtime_flow tested in 5.80s, 1173 queries
2019-03-13 18:26:28 INFO server odoo.modules.module:515 run_unit_tests odoo.addons.hr_residence.tests.test_residence_flow tested in 5.79s, 1101 queries
2019-03-13 18:26:41 INFO server odoo.modules.module:515 run_unit_tests odoo.addons.hr_resignation.tests.test_resignation_flow tested in 5.55s, 1131 queries
2019-03-13 18:27:48 INFO server odoo.modules.module:515 run_unit_tests odoo.addons.purchase_request.tests.test_purchase_flow tested in 33.93s, 3386 queries
2019-03-13 18:29:13 INFO server odoo.modules.module:515 run_unit_tests odoo.addons.website_forum.tests.test_forum tested in 16.90s, 4663 queries
2019-03-13 18:31:11 INFO server odoo.modules.module:515 run_unit_tests odoo.addons.hr_attendance_extend.tests.test_attendnace_summary tested in 10.35s, 2989 queries
2019-03-13 18:31:31 INFO server odoo.modules.module:515 run_unit_tests odoo.addons.hr_attendance_extend.tests.test_authorization_flow tested in 20.71s, 1302 queries
2019-03-13 18:32:46 INFO server odoo.modules.module:515 run_unit_tests odoo.addons.hr_deputation.tests.test_deputation_flow tested in 32.58s, 4024 queries
2019-03-13 18:34:16 INFO server odoo.modules.module:515 run_unit_tests odoo.addons.hr_holidays_extend.tests.test_holidays_flow tested in 46.89s, 6961 queries
2019-03-13 18:34:33 INFO server odoo.modules.module:515 run_unit_tests odoo.addons.hr_recruitment_extend.tests.test_job_request_flow tested in 5.22s, 1163 queries
2019-03-13 18:35:28 INFO server odoo.modules.module:515 run_unit_tests odoo.addons.hr_training.tests.test_application_constrains tested in 8.95s, 1637 queries
2019-03-13 18:35:35 INFO server odoo.modules.module:515 run_unit_tests odoo.addons.hr_training.tests.test_application_flow tested in 6.95s, 2071 queries
2019-03-13 18:35:40 ERROR server odoo.addons.hr_training.tests.test_training_constrains:474 write ERROR
2019-03-13 18:35:40 ERROR server odoo.addons.hr_training.tests.test_training_constrains:474 write ERROR: test_training_constrains (odoo.addons.hr_training.tests.test_training_constrains.TestTrainingConstrains)
2019-03-13 18:35:40 ERROR server odoo.addons.hr_training.tests.test_training_constrains:474 write ` Test Training constraint.
2019-03-13 18:35:40 ERROR server odoo.addons.hr_training.tests.test_training_constrains:474 write Traceback (most recent call last):
2019-03-13 18:35:40 ERROR server odoo.addons.hr_training.tests.test_training_constrains:474 write ` File "/mnt/vdb/odoo/addons_runbot/runbot/static/build/09160-11-18-841b4b/addons/hr_training/tests/test_training_constrains.py", line 76, in test_training_constrains
2019-03-13 18:35:40 ERROR server odoo.addons.hr_training.tests.test_training_constrains:474 write ` 'published': True})
2019-03-13 18:35:40 ERROR server odoo.addons.hr_training.tests.test_training_constrains:474 write ` File "/mnt/vdb/odoo/addons_runbot/runbot/static/build/09160-11-18-841b4b/addons/hr_training/models/hr_training.py", line 50, in create
2019-03-13 18:35:40 ERROR server odoo.addons.hr_training.tests.test_training_constrains:474 write ` return super(HrTraining, self).create(vals)
2019-03-13 18:35:40 ERROR server odoo.addons.hr_training.tests.test_training_constrains:474 write ` File "/opt/odoo/odoo11/addons/mail/models/mail_thread.py", line 236, in create
2019-03-13 18:35:40 ERROR server odoo.addons.hr_training.tests.test_training_constrains:474 write ` thread = super(MailThread, self).create(values)
2019-03-13 18:35:40 ERROR server odoo.addons.hr_training.tests.test_training_constrains:474 write ` File "/mnt/vdb/odoo/addons_runbot/runbot/static/build/09160-11-18-841b4b/addons/popup_reminder/models/popup_reminder.py", line 32, in create
2019-03-13 18:35:40 ERROR server odoo.addons.hr_training.tests.test_training_constrains:474 write ` record_id = create_original(self, vals)
2019-03-13 18:35:40 ERROR server odoo.addons.hr_training.tests.test_training_constrains:474 write ` File "/opt/odoo/odoo11/odoo/models.py", line 3372, in create
2019-03-13 18:35:40 ERROR server odoo.addons.hr_training.tests.test_training_constrains:474 write ` record = self.browse(self._create(old_vals))
2019-03-13 18:35:40 ERROR server odoo.addons.hr_training.tests.test_training_constrains:474 write ` File "/opt/odoo/odoo11/odoo/models.py", line 3525, in _create
2019-03-13 18:35:40 ERROR server odoo.addons.hr_training.tests.test_training_constrains:474 write ` self._validate_fields(vals)
2019-03-13 18:35:40 ERROR server odoo.addons.hr_training.tests.test_training_constrains:474 write ` File "/opt/odoo/odoo11/odoo/models.py", line 1036, in _validate_fields
2019-03-13 18:35:40 ERROR server odoo.addons.hr_training.tests.test_training_constrains:474 write ` check(self)
2019-03-13 18:35:40 ERROR server odoo.addons.hr_training.tests.test_training_constrains:474 write ` File "/mnt/vdb/odoo/addons_runbot/runbot/static/build/09160-11-18-841b4b/addons/hr_training/models/hr_training.py", line 80, in _check_order_chek_date
2019-03-13 18:35:40 ERROR server odoo.addons.hr_training.tests.test_training_constrains:474 write ` raise ValidationError(_(" تاريخ التدريب يجب أن يكون أكبر من تاريخ اليوم"))
2019-03-13 18:35:40 ERROR server odoo.addons.hr_training.tests.test_training_constrains:474 write ` odoo.exceptions.ValidationError: (' تاريخ التدريب يجب أن يكون أكبر من تاريخ اليوم', None)
2019-03-13 18:35:40 ERROR server odoo.addons.hr_training.tests.test_training_constrains:474 write FAILED
2019-03-13 18:35:40 ERROR server odoo.modules.module:518 run_unit_tests Module hr_training: 0 failures, 1 errors
2019-03-13 18:36:13 INFO server odoo.modules.module:515 run_unit_tests odoo.addons.hr_training.tests.test_training_flow tested in 33.60s, 4683 queries
2019-03-13 18:36:21 INFO server odoo.modules.module:515 run_unit_tests odoo.addons.hr_training.tests.test_training_public_flow tested in 7.94s, 1906 queries
2019-03-13 18:36:29 INFO server odoo.modules.module:515 run_unit_tests odoo.addons.hr_training.tests.test_training_request_constrains tested in 8.10s, 2148 queries
2019-03-13 18:36:40 INFO server odoo.modules.module:515 run_unit_tests odoo.addons.hr_training.tests.test_training_request_flow tested in 10.63s, 2766 queries
2019-03-13 18:37:36 INFO server odoo.modules.module:515 run_unit_tests odoo.addons.project_maintenance.tests.test_project_maintenance_flow tested in 32.04s, 6309 queries
2019-03-13 18:38:19 INFO server odoo.modules.module:515 run_unit_tests odoo.addons.crm_help.tests.test_crm_help_flow tested in 5.95s, 1310 queries
2019-03-13 18:38:48 INFO server odoo.modules.module:515 run_unit_tests odoo.addons.crm_visit.tests.test_crm_visit_flow tested in 6.67s, 1310 queries
2019-03-13 18:39:11 INFO server odoo.modules.module:515 run_unit_tests odoo.addons.hr_attendance_deputation.tests.test_attendnace_summary tested in 7.09s, 1722 queries
2019-03-13 18:39:28 INFO server odoo.modules.module:515 run_unit_tests odoo.addons.hr_attendance_training.tests.test_attendnace_summary tested in 9.44s, 2372 queries
2019-03-13 18:39:42 INFO server odoo.modules.module:515 run_unit_tests odoo.addons.hr_deputation_delegacy.tests.test_deputation_delegacy tested in 9.53s, 1765 queries
2019-03-13 18:39:59 INFO server odoo.modules.module:515 run_unit_tests odoo.addons.hr_deputation_training.tests.test_deputation_training_flow tested in 9.22s, 1580 queries
2019-03-13 18:40:08 INFO server odoo.modules.module:515 run_unit_tests odoo.addons.hr_deputation_training.tests.test_hr_deputation_training_constrains tested in 9.21s, 2014 queries
2019-03-13 18:40:19 INFO server odoo.modules.module:515 run_unit_tests odoo.addons.hr_holidays_attendance.tests.test_attendnace_summary tested in 7.95s, 1989 queries
2019-03-13 18:40:28 INFO server odoo.modules.module:515 run_unit_tests odoo.addons.hr_holidays_delegacy.tests.test_holidays_delegacy_flow tested in 5.54s, 785 queries
2019-03-13 18:40:38 INFO server odoo.modules.module:515 run_unit_tests odoo.addons.hr_holidays_deputation.tests.test_deputation_holiday_flow tested in 6.41s, 1289 queries
2019-03-13 18:40:52 INFO server odoo.modules.module:515 run_unit_tests odoo.addons.hr_holidays_training.tests.test_holidays_training_flow tested in 5.76s, 986 queries
2019-03-13 18:41:00 INFO server odoo.modules.module:515 run_unit_tests odoo.addons.hr_holidays_training.tests.test_hr_holidays_training_constrains tested in 7.34s, 2035 queries
2019-03-13 18:42:23 INFO server odoo.modules.module:515 run_unit_tests odoo.addons.hr_training_delegacy.tests.test_hr_training_delegacy_constrains tested in 5.71s, 1148 queries
2019-03-13 18:45:09 INFO server odoo.modules.loading:234 load_module_graph 169 modules loaded in 2547.75s, 171816 queries
2019-03-13 18:46:09 INFO server odoo.modules.loading:234 load_module_graph 173 modules loaded in 60.40s, 11 queries
2019-03-13 18:46:12 ERROR server odoo.modules.loading:471 load_modules At least one test failed when loading the modules.
2019-03-13 18:46:45 INFO server odoo.modules.module:515 run_unit_tests odoo.addons.base.tests.test_reports tested in 31.79s, 1055 queries
2019-03-13 18:46:54 INFO server odoo.modules.module:515 run_unit_tests odoo.addons.base_automation.tests.test_base_automation tested in 6.76s, 1813 queries
2019-03-13 18:47:03 INFO server odoo.modules.module:515 run_unit_tests odoo.addons.account.tests.test_account_customer_invoice tested in 8.92s, 2648 queries
2019-03-13 18:47:18 INFO server odoo.modules.module:515 run_unit_tests odoo.addons.account.tests.test_account_invoice_rounding tested in 15.48s, 4190 queries
2019-03-13 18:47:25 INFO server odoo.modules.module:515 run_unit_tests odoo.addons.account.tests.test_account_supplier_invoice tested in 6.49s, 1701 queries
2019-03-13 18:47:33 INFO server odoo.modules.module:515 run_unit_tests odoo.addons.account.tests.test_bank_statement_reconciliation tested in 7.38s, 1918 queries
2019-03-13 18:48:21 INFO server odoo.modules.module:515 run_unit_tests odoo.addons.account.tests.test_payment tested in 47.70s, 14515 queries
2019-03-13 18:50:31 INFO server odoo.modules.module:515 run_unit_tests odoo.addons.account.tests.test_reconciliation tested in 126.58s, 37461 queries
2019-03-13 18:50:37 INFO server odoo.modules.module:515 run_unit_tests odoo.addons.account.tests.test_search tested in 6.00s, 1635 queries
2019-03-13 18:51:01 INFO server odoo.modules.module:515 run_unit_tests odoo.addons.account.tests.test_tax tested in 22.48s, 5475 queries
2019-03-13 18:51:13 ERROR server odoo.addons.website.models.ir_http:206 _handle_exception
500 Internal Server Error:

Traceback (most recent call last):
  File "/opt/odoo/odoo11/odoo/tools/cache.py", line 84, in lookup
    r = d[key]
  File "/opt/odoo/odoo11/odoo/tools/func.py", line 68, in wrapper
    return func(self, *args, **kwargs)
  File "/opt/odoo/odoo11/odoo/tools/lru.py", line 44, in __getitem__
    a = self.d[obj].me
KeyError: ('ir.qweb', <function IrQWeb._get_asset_nodes at 0x7f335b5c4268>, 'web.assets_frontend', 'ar_SY', True, False, None, False, False, (1,))

During handling of the above exception, another exception occurred:

Traceback (most recent call last):
  File "/opt/odoo/odoo11/odoo/fields.py", line 937, in __get__
    value = record.env.cache.get(record, self)
  File "/opt/odoo/odoo11/odoo/api.py", line 960, in get
    value = self._data[field][record.id][key]
KeyError: <odoo.api.Environment object at 0x7f3358c2e588>

During handling of the above exception, another exception occurred:

Traceback (most recent call last):
  File "/opt/odoo/odoo11/odoo/fields.py", line 937, in __get__
    value = record.env.cache.get(record, self)
  File "/opt/odoo/odoo11/odoo/api.py", line 960, in get
    value = self._data[field][record.id][key]
KeyError: (<odoo.sql_db.TestCursor object at 0x7f33589f0828>, 1)

During handling of the above exception, another exception occurred:

Traceback (most recent call last):
  File "/opt/odoo/odoo11/odoo/addons/base/ir/ir_qweb/qweb.py", line 343, in _compiled_fn
    return compiled(self, append, new, options, log)
  File "<template>", line 1, in template_web_login_layout_2281
  File "<template>", line 2, in body_call_content_2280
  File "<template>", line 4, in set_2278
  File "<decorator-gen-39>", line 2, in _get_asset_nodes
  File "/opt/odoo/odoo11/odoo/tools/cache.py", line 89, in lookup
    value = d[key] = self.method(*args, **kwargs)
  File "/opt/odoo/odoo11/odoo/addons/base/ir/ir_qweb/ir_qweb.py", line 302, in _get_asset_nodes
    return remains + asset.to_node(css=css, js=js, debug=debug, async_load=async_load)
  File "/opt/odoo/odoo11/odoo/addons/base/ir/ir_qweb/assetsbundle.py", line 153, in to_node
    css_attachments = self.css() or []
  File "/opt/odoo/odoo11/odoo/addons/base/ir/ir_qweb/assetsbundle.py", line 310, in css
    self.save_attachment("css", ' '.join(page), inc=idx)
  File "/opt/odoo/odoo11/odoo/addons/base/ir/ir_qweb/assetsbundle.py", line 257, in save_attachment
    attachment = ira.sudo().create(values)
  File "/mnt/vdb/odoo/addons_runbot/runbot/static/build/09160-11-18-841b4b/addons/dms/models/ir_attachment.py", line 22, in create
    return super(IrAttachment, self).create(vals)
  File "/opt/odoo/odoo11/odoo/addons/base/ir/ir_attachment.py", line 466, in create
    return super(IrAttachment, self).create(values)
  File "/mnt/vdb/odoo/addons_runbot/runbot/static/build/09160-11-18-841b4b/addons/popup_reminder/models/popup_reminder.py", line 32, in create
    record_id = create_original(self, vals)
  File "/opt/odoo/odoo11/odoo/models.py", line 3372, in create
    record = self.browse(self._create(old_vals))
  File "/opt/odoo/odoo11/odoo/models.py", line 3529, in _create
    self.recompute()
  File "/opt/odoo/odoo11/odoo/models.py", line 4904, in recompute
    vals = {n: rec[n] for n in ns}
  File "/opt/odoo/odoo11/odoo/models.py", line 4904, in <dictcomp>
    vals = {n: rec[n] for n in ns}
  File "/opt/odoo/odoo11/odoo/models.py", line 4758, in __getitem__
    return self._fields[key].__get__(self, type(self))
  File "/opt/odoo/odoo11/odoo/fields.py", line 941, in __get__
    self.determine_value(record)
  File "/opt/odoo/odoo11/odoo/fields.py", line 1028, in determine_value
    self.compute_value(recs)
  File "/opt/odoo/odoo11/odoo/fields.py", line 1008, in compute_value
    self._compute_value(records)
  File "/opt/odoo/odoo11/odoo/fields.py", line 999, in _compute_value
    getattr(records, self.compute)()
  File "/mnt/vdb/odoo/addons_runbot/runbot/static/build/09160-11-18-841b4b/addons/base_attachment/models/attachment.py", line 33, in _compute_extension
    if record.mimetype:
  File "/opt/odoo/odoo11/odoo/fields.py", line 941, in __get__
    self.determine_value(record)
  File "/opt/odoo/odoo11/odoo/fields.py", line 1042, in determine_value
    record._prefetch_field(self)
  File "/opt/odoo/odoo11/odoo/models.py", line 2646, in _prefetch_field
    result = records.read([f.name for f in fs], load='_classic_write')
  File "/opt/odoo/odoo11/odoo/addons/base/ir/ir_attachment.py", line 427, in read
    return super(IrAttachment, self).read(fields, load=load)
  File "/opt/odoo/odoo11/odoo/models.py", line 2590, in read
    self._read_from_database(stored, inherited)
  File "/opt/odoo/odoo11/odoo/models.py", line 2710, in _read_from_database
    result.extend(cr.dictfetchall())
  File "/opt/odoo/odoo11/odoo/sql_db.py", line 203, in dictfetchall
    return [self.__build_dict(row) for row in self._obj.fetchall()]
  File "/opt/odoo/odoo11/odoo/sql_db.py", line 154, in wrapper
    raise psycopg2.OperationalError(msg)
psycopg2.OperationalError: Unable to use a closed cursor.

During handling of the above exception, another exception occurred:

Traceback (most recent call last):
  File "/opt/odoo/odoo11/odoo/tools/cache.py", line 84, in lookup
    r = d[key]
  File "/opt/odoo/odoo11/odoo/tools/func.py", line 68, in wrapper
    return func(self, *args, **kwargs)
  File "/opt/odoo/odoo11/odoo/tools/lru.py", line 44, in __getitem__
    a = self.d[obj].me
KeyError: ('ir.ui.view', <function View.get_view_id at 0x7f3358b6e048>, 4, 'web.login_layout', (1,))

During handling of the above exception, another exception occurred:

Traceback (most recent call last):
  File "/opt/odoo/odoo11/odoo/tools/cache.py", line 84, in lookup
    r = d[key]
  File "/opt/odoo/odoo11/odoo/tools/func.py", line 68, in wrapper
    return func(self, *args, **kwargs)
  File "/opt/odoo/odoo11/odoo/tools/lru.py", line 44, in __getitem__
    a = self.d[obj].me
KeyError: ('ir.model.access', <function IrModelAccess.check at 0x7f33603698c8>, 4, 'ir.ui.view', 'read', True, ('ar_SY',))

During handling of the above exception, another exception occurred:

Traceback (most recent call last):
  File "/opt/odoo/odoo11/odoo/addons/base/ir/ir_qweb/qweb.py", line 369, in get_template
    document = options.get('load', self.load)(template, options)
  File "/opt/odoo/odoo11/odoo/addons/base/ir/ir_qweb/ir_qweb.py", line 85, in load
    template = env['ir.ui.view'].read_template(name)
  File "/opt/odoo/odoo11/odoo/addons/base/ir/ir_ui_view.py", line 1103, in read_template
    return self._read_template(self.get_view_id(xml_id))
  File "<decorator-gen-160>", line 2, in get_view_id
  File "/opt/odoo/odoo11/odoo/tools/cache.py", line 89, in lookup
    value = d[key] = self.method(*args, **kwargs)
  File "/opt/odoo/odoo11/addons/website/models/ir_ui_view.py", line 87, in get_view_id
    view = self.search(domain, order='website_id', limit=1)
  File "/opt/odoo/odoo11/odoo/models.py", line 1480, in search
    res = self._search(args, offset=offset, limit=limit, order=order, count=count)
  File "/opt/odoo/odoo11/odoo/models.py", line 3767, in _search
    self.sudo(access_rights_uid or self._uid).check_access_rights('read')
  File "/opt/odoo/odoo11/odoo/models.py", line 2862, in check_access_rights
    return self.env['ir.model.access'].check(self._name, operation, raise_exception)
  File "<decorator-gen-20>", line 2, in check
  File "/opt/odoo/odoo11/odoo/tools/cache.py", line 89, in lookup
    value = d[key] = self.method(*args, **kwargs)
  File "/opt/odoo/odoo11/odoo/addons/base/ir/ir_model.py", line 1171, in check
    (model, self._uid,))
  File "/opt/odoo/odoo11/odoo/sql_db.py", line 154, in wrapper
    raise psycopg2.OperationalError(msg)
psycopg2.OperationalError: Unable to use a closed cursor.

During handling of the above exception, another exception occurred:

Traceback (most recent call last):
  File "/opt/odoo/odoo11/odoo/addons/base/ir/ir_http.py", line 208, in _dispatch
    result = request.dispatch()
  File "/opt/odoo/odoo11/odoo/http.py", line 829, in dispatch
    r = self._call_function(**self.params)
  File "/opt/odoo/odoo11/odoo/http.py", line 342, in _call_function
    return checked_call(self.db, *args, **kwargs)
  File "/opt/odoo/odoo11/odoo/service/model.py", line 97, in wrapper
    return f(dbname, *args, **kwargs)
  File "/opt/odoo/odoo11/odoo/http.py", line 338, in checked_call
    result.flatten()
  File "/opt/odoo/odoo11/odoo/http.py", line 1269, in flatten
    self.response.append(self.render())
  File "/opt/odoo/odoo11/odoo/http.py", line 1262, in render
    return env["ir.ui.view"].render_template(self.template, self.qcontext)
  File "/opt/odoo/odoo11/odoo/addons/base/ir/ir_ui_view.py", line 1208, in render_template
    return self.browse(self.get_view_id(template)).render(values, engine)
  File "/opt/odoo/odoo11/addons/website/models/ir_ui_view.py", line 113, in render
    return super(View, self).render(values, engine=engine)
  File "/opt/odoo/odoo11/addons/web_editor/models/ir_ui_view.py", line 27, in render
    return super(IrUiView, self).render(values=values, engine=engine)
  File "/opt/odoo/odoo11/odoo/addons/base/ir/ir_ui_view.py", line 1217, in render
    return self.env[engine].render(self.id, qcontext)
  File "/mnt/vdb/odoo/addons_runbot/runbot/static/build/09160-11-18-841b4b/addons/odoo_rtl/models/ir_qweb.py", line 20, in render
    return super(IrQWeb, self).render(id_or_xml_id, values=values, **options)
  File "/opt/odoo/odoo11/odoo/addons/base/ir/ir_qweb/ir_qweb.py", line 57, in render
    return super(IrQWeb, self).render(id_or_xml_id, values=values, **context)
  File "/opt/odoo/odoo11/odoo/addons/base/ir/ir_qweb/qweb.py", line 272, in render
    self.compile(template, options)(self, body.append, values or {})
  File "/opt/odoo/odoo11/odoo/addons/base/ir/ir_qweb/qweb.py", line 345, in _compiled_fn
    raise e
  File "/opt/odoo/odoo11/odoo/addons/base/ir/ir_qweb/qweb.py", line 343, in _compiled_fn
    return compiled(self, append, new, options, log)
  File "<template>", line 1, in template_402_2275
  File "/opt/odoo/odoo11/odoo/addons/base/ir/ir_qweb/qweb.py", line 348, in _compiled_fn
    element, document = self.get_template(template, options)
  File "/opt/odoo/odoo11/odoo/addons/base/ir/ir_qweb/qweb.py", line 373, in get_template
    raise QWebException("load could not load template", name=template)
odoo.addons.base.ir.ir_qweb.qweb.QWebException: None
Traceback (most recent call last):
  File "/opt/odoo/odoo11/odoo/tools/cache.py", line 84, in lookup
    r = d[key]
  File "/opt/odoo/odoo11/odoo/tools/func.py", line 68, in wrapper
    return func(self, *args, **kwargs)
  File "/opt/odoo/odoo11/odoo/tools/lru.py", line 44, in __getitem__
    a = self.d[obj].me
KeyError: ('ir.qweb', <function IrQWeb._get_asset_nodes at 0x7f335b5c4268>, 'web.assets_frontend', 'ar_SY', True, False, None, False, False, (1,))

During handling of the above exception, another exception occurred:

Traceback (most recent call last):
  File "/opt/odoo/odoo11/odoo/fields.py", line 937, in __get__
    value = record.env.cache.get(record, self)
  File "/opt/odoo/odoo11/odoo/api.py", line 960, in get
    value = self._data[field][record.id][key]
KeyError: <odoo.api.Environment object at 0x7f3358c2e588>

During handling of the above exception, another exception occurred:

Traceback (most recent call last):
  File "/opt/odoo/odoo11/odoo/fields.py", line 937, in __get__
    value = record.env.cache.get(record, self)
  File "/opt/odoo/odoo11/odoo/api.py", line 960, in get
    value = self._data[field][record.id][key]
KeyError: (<odoo.sql_db.TestCursor object at 0x7f33589f0828>, 1)

During handling of the above exception, another exception occurred:

Traceback (most recent call last):
  File "/opt/odoo/odoo11/odoo/addons/base/ir/ir_qweb/qweb.py", line 343, in _compiled_fn
    return compiled(self, append, new, options, log)
  File "<template>", line 1, in template_web_login_layout_2281
  File "<template>", line 2, in body_call_content_2280
  File "<template>", line 4, in set_2278
  File "<decorator-gen-39>", line 2, in _get_asset_nodes
  File "/opt/odoo/odoo11/odoo/tools/cache.py", line 89, in lookup
    value = d[key] = self.method(*args, **kwargs)
  File "/opt/odoo/odoo11/odoo/addons/base/ir/ir_qweb/ir_qweb.py", line 302, in _get_asset_nodes
    return remains + asset.to_node(css=css, js=js, debug=debug, async_load=async_load)
  File "/opt/odoo/odoo11/odoo/addons/base/ir/ir_qweb/assetsbundle.py", line 153, in to_node
    css_attachments = self.css() or []
  File "/opt/odoo/odoo11/odoo/addons/base/ir/ir_qweb/assetsbundle.py", line 310, in css
    self.save_attachment("css", ' '.join(page), inc=idx)
  File "/opt/odoo/odoo11/odoo/addons/base/ir/ir_qweb/assetsbundle.py", line 257, in save_attachment
    attachment = ira.sudo().create(values)
  File "/mnt/vdb/odoo/addons_runbot/runbot/static/build/09160-11-18-841b4b/addons/dms/models/ir_attachment.py", line 22, in create
    return super(IrAttachment, self).create(vals)
  File "/opt/odoo/odoo11/odoo/addons/base/ir/ir_attachment.py", line 466, in create
    return super(IrAttachment, self).create(values)
  File "/mnt/vdb/odoo/addons_runbot/runbot/static/build/09160-11-18-841b4b/addons/popup_reminder/models/popup_reminder.py", line 32, in create
    record_id = create_original(self, vals)
  File "/opt/odoo/odoo11/odoo/models.py", line 3372, in create
    record = self.browse(self._create(old_vals))
  File "/opt/odoo/odoo11/odoo/models.py", line 3529, in _create
    self.recompute()
  File "/opt/odoo/odoo11/odoo/models.py", line 4904, in recompute
    vals = {n: rec[n] for n in ns}
  File "/opt/odoo/odoo11/odoo/models.py", line 4904, in <dictcomp>
    vals = {n: rec[n] for n in ns}
  File "/opt/odoo/odoo11/odoo/models.py", line 4758, in __getitem__
    return self._fields[key].__get__(self, type(self))
  File "/opt/odoo/odoo11/odoo/fields.py", line 941, in __get__
    self.determine_value(record)
  File "/opt/odoo/odoo11/odoo/fields.py", line 1028, in determine_value
    self.compute_value(recs)
  File "/opt/odoo/odoo11/odoo/fields.py", line 1008, in compute_value
    self._compute_value(records)
  File "/opt/odoo/odoo11/odoo/fields.py", line 999, in _compute_value
    getattr(records, self.compute)()
  File "/mnt/vdb/odoo/addons_runbot/runbot/static/build/09160-11-18-841b4b/addons/base_attachment/models/attachment.py", line 33, in _compute_extension
    if record.mimetype:
  File "/opt/odoo/odoo11/odoo/fields.py", line 941, in __get__
    self.determine_value(record)
  File "/opt/odoo/odoo11/odoo/fields.py", line 1042, in determine_value
    record._prefetch_field(self)
  File "/opt/odoo/odoo11/odoo/models.py", line 2646, in _prefetch_field
    result = records.read([f.name for f in fs], load='_classic_write')
  File "/opt/odoo/odoo11/odoo/addons/base/ir/ir_attachment.py", line 427, in read
    return super(IrAttachment, self).read(fields, load=load)
  File "/opt/odoo/odoo11/odoo/models.py", line 2590, in read
    self._read_from_database(stored, inherited)
  File "/opt/odoo/odoo11/odoo/models.py", line 2710, in _read_from_database
    result.extend(cr.dictfetchall())
  File "/opt/odoo/odoo11/odoo/sql_db.py", line 203, in dictfetchall
    return [self.__build_dict(row) for row in self._obj.fetchall()]
  File "/opt/odoo/odoo11/odoo/sql_db.py", line 154, in wrapper
    raise psycopg2.OperationalError(msg)
psycopg2.OperationalError: Unable to use a closed cursor.

During handling of the above exception, another exception occurred:

Traceback (most recent call last):
  File "/opt/odoo/odoo11/odoo/tools/cache.py", line 84, in lookup
    r = d[key]
  File "/opt/odoo/odoo11/odoo/tools/func.py", line 68, in wrapper
    return func(self, *args, **kwargs)
  File "/opt/odoo/odoo11/odoo/tools/lru.py", line 44, in __getitem__
    a = self.d[obj].me
KeyError: ('ir.ui.view', <function View.get_view_id at 0x7f3358b6e048>, 4, 'web.login_layout', (1,))

During handling of the above exception, another exception occurred:

Traceback (most recent call last):
  File "/opt/odoo/odoo11/odoo/tools/cache.py", line 84, in lookup
    r = d[key]
  File "/opt/odoo/odoo11/odoo/tools/func.py", line 68, in wrapper
    return func(self, *args, **kwargs)
  File "/opt/odoo/odoo11/odoo/tools/lru.py", line 44, in __getitem__
    a = self.d[obj].me
KeyError: ('ir.model.access', <function IrModelAccess.check at 0x7f33603698c8>, 4, 'ir.ui.view', 'read', True, ('ar_SY',))

During handling of the above exception, another exception occurred:

Traceback (most recent call last):
  File "/opt/odoo/odoo11/odoo/addons/base/ir/ir_qweb/qweb.py", line 369, in get_template
    document = options.get('load', self.load)(template, options)
  File "/opt/odoo/odoo11/odoo/addons/base/ir/ir_qweb/ir_qweb.py", line 85, in load
    template = env['ir.ui.view'].read_template(name)
  File "/opt/odoo/odoo11/odoo/addons/base/ir/ir_ui_view.py", line 1103, in read_template
    return self._read_template(self.get_view_id(xml_id))
  File "<decorator-gen-160>", line 2, in get_view_id
  File "/opt/odoo/odoo11/odoo/tools/cache.py", line 89, in lookup
    value = d[key] = self.method(*args, **kwargs)
  File "/opt/odoo/odoo11/addons/website/models/ir_ui_view.py", line 87, in get_view_id
    view = self.search(domain, order='website_id', limit=1)
  File "/opt/odoo/odoo11/odoo/models.py", line 1480, in search
    res = self._search(args, offset=offset, limit=limit, order=order, count=count)
  File "/opt/odoo/odoo11/odoo/models.py", line 3767, in _search
    self.sudo(access_rights_uid or self._uid).check_access_rights('read')
  File "/opt/odoo/odoo11/odoo/models.py", line 2862, in check_access_rights
    return self.env['ir.model.access'].check(self._name, operation, raise_exception)
  File "<decorator-gen-20>", line 2, in check
  File "/opt/odoo/odoo11/odoo/tools/cache.py", line 89, in lookup
    value = d[key] = self.method(*args, **kwargs)
  File "/opt/odoo/odoo11/odoo/addons/base/ir/ir_model.py", line 1171, in check
    (model, self._uid,))
  File "/opt/odoo/odoo11/odoo/sql_db.py", line 154, in wrapper
    raise psycopg2.OperationalError(msg)
psycopg2.OperationalError: Unable to use a closed cursor.

load could not load template
Template: web.login_layout
2019-03-13 18:51:13 ERROR server odoo.addons.website.tests.test_crawl:474 write ERROR
2019-03-13 18:51:15 ERROR server werkzeug:87 _log
Error on request:
Traceback (most recent call last):
  File "/usr/local/lib/python3.5/dist-packages/werkzeug/serving.py", line 209, in run_wsgi
    execute(self.server.app)
  File "/usr/local/lib/python3.5/dist-packages/werkzeug/serving.py", line 197, in execute
    application_iter = app(environ, start_response)
  File "/opt/odoo/odoo11/odoo/service/server.py", line 260, in app
    return self.app(e, s)
  File "/opt/odoo/odoo11/odoo/service/wsgi_server.py", line 166, in application
    return application_unproxied(environ, start_response)
  File "/opt/odoo/odoo11/odoo/service/wsgi_server.py", line 154, in application_unproxied
    result = handler(environ, start_response)
  File "/opt/odoo/odoo11/odoo/http.py", line 1318, in __call__
    return self.dispatch(environ, start_response)
  File "/opt/odoo/odoo11/odoo/http.py", line 1292, in __call__
    return self.app(environ, start_wrapped)
  File "/usr/local/lib/python3.5/dist-packages/werkzeug/wsgi.py", line 600, in __call__
    return self.app(environ, start_response)
  File "/opt/odoo/odoo11/odoo/http.py", line 1490, in dispatch
    result = ir_http._dispatch()
  File "/opt/odoo/odoo11/addons/auth_signup/models/ir_http.py", line 19, in _dispatch
    return super(Http, cls)._dispatch()
  File "/opt/odoo/odoo11/addons/web_editor/models/ir_http.py", line 22, in _dispatch
    return super(IrHttp, cls)._dispatch()
  File "/opt/odoo/odoo11/addons/http_routing/models/ir_http.py", line 393, in _dispatch
    result = super(IrHttp, cls)._dispatch()
  File "/opt/odoo/odoo11/addons/utm/models/ir_http.py", line 26, in _dispatch
    response = super(IrHttp, cls)._dispatch()
  File "/opt/odoo/odoo11/odoo/addons/base/ir/ir_http.py", line 212, in _dispatch
    return cls._handle_exception(e)
  File "/opt/odoo/odoo11/addons/website/models/ir_http.py", line 221, in _handle_exception
    if request.website.is_publisher() and isinstance(exception, werkzeug.exceptions.NotFound):
  File "/opt/odoo/odoo11/addons/website/models/website.py", line 400, in is_publisher
    return self.env['ir.model.access'].check('ir.ui.view', 'write', False)
  File "<decorator-gen-20>", line 2, in check
    
  File "/opt/odoo/odoo11/odoo/tools/cache.py", line 89, in lookup
    value = d[key] = self.method(*args, **kwargs)
  File "/opt/odoo/odoo11/odoo/addons/base/ir/ir_model.py", line 1171, in check
    (model, self._uid,))
  File "/opt/odoo/odoo11/odoo/sql_db.py", line 154, in wrapper
    raise psycopg2.OperationalError(msg)
psycopg2.OperationalError: Unable to use a closed cursor.
2019-03-13 18:51:23 ERROR server odoo.addons.website.tests.test_crawl:474 write ERROR
2019-03-13 18:51:31 ERROR server odoo.addons.website.models.ir_http:206 _handle_exception
500 Internal Server Error:

Traceback (most recent call last):
  File "/opt/odoo/odoo11/odoo/tools/cache.py", line 84, in lookup
    r = d[key]
  File "/opt/odoo/odoo11/odoo/tools/func.py", line 68, in wrapper
    return func(self, *args, **kwargs)
  File "/opt/odoo/odoo11/odoo/tools/lru.py", line 44, in __getitem__
    a = self.d[obj].me
KeyError: ('ir.qweb', <function IrQWeb._get_asset_nodes at 0x7f335b5c4268>, 'web.assets_frontend', 'ar_SY', True, False, None, False, False, (1,))

During handling of the above exception, another exception occurred:

Traceback (most recent call last):
  File "/opt/odoo/odoo11/odoo/addons/base/ir/ir_qweb/qweb.py", line 343, in _compiled_fn
    return compiled(self, append, new, options, log)
  File "<template>", line 1, in template_website_base_layout_2358
  File "<template>", line 2, in body_call_content_2357
  File "<template>", line 19, in set_2344
  File "<decorator-gen-39>", line 2, in _get_asset_nodes
  File "/opt/odoo/odoo11/odoo/tools/cache.py", line 89, in lookup
    value = d[key] = self.method(*args, **kwargs)
  File "/opt/odoo/odoo11/odoo/addons/base/ir/ir_qweb/ir_qweb.py", line 302, in _get_asset_nodes
    return remains + asset.to_node(css=css, js=js, debug=debug, async_load=async_load)
  File "/opt/odoo/odoo11/odoo/addons/base/ir/ir_qweb/assetsbundle.py", line 153, in to_node
    css_attachments = self.css() or []
  File "/opt/odoo/odoo11/odoo/addons/base/ir/ir_qweb/assetsbundle.py", line 310, in css
    self.save_attachment("css", ' '.join(page), inc=idx)
  File "/opt/odoo/odoo11/odoo/addons/base/ir/ir_qweb/assetsbundle.py", line 257, in save_attachment
    attachment = ira.sudo().create(values)
  File "/mnt/vdb/odoo/addons_runbot/runbot/static/build/09160-11-18-841b4b/addons/dms/models/ir_attachment.py", line 20, in create
    number_ir_attachment = self.env['ir.sequence'].next_by_code('ir.attachment.seq')
  File "/opt/odoo/odoo11/odoo/addons/base/ir/ir_sequence.py", line 282, in next_by_code
    seq_ids = self.search([('code', '=', sequence_code), ('company_id', 'in', [force_company, False])], order='company_id')
  File "/opt/odoo/odoo11/odoo/models.py", line 1480, in search
    res = self._search(args, offset=offset, limit=limit, order=order, count=count)
  File "/opt/odoo/odoo11/odoo/models.py", line 3791, in _search
    self._cr.execute(query_str, where_clause_params)
  File "/opt/odoo/odoo11/odoo/sql_db.py", line 154, in wrapper
    raise psycopg2.OperationalError(msg)
psycopg2.OperationalError: Unable to use a closed cursor.

During handling of the above exception, another exception occurred:

Traceback (most recent call last):
  File "/opt/odoo/odoo11/odoo/tools/cache.py", line 84, in lookup
    r = d[key]
  File "/opt/odoo/odoo11/odoo/tools/func.py", line 68, in wrapper
    return func(self, *args, **kwargs)
  File "/opt/odoo/odoo11/odoo/tools/lru.py", line 44, in __getitem__
    a = self.d[obj].me
KeyError: ('ir.ui.view', <function View.get_view_id at 0x7f3358b6e048>, 5, 'website_base.layout', (1,))

During handling of the above exception, another exception occurred:

Traceback (most recent call last):
  File "/opt/odoo/odoo11/odoo/tools/cache.py", line 84, in lookup
    r = d[key]
  File "/opt/odoo/odoo11/odoo/tools/func.py", line 68, in wrapper
    return func(self, *args, **kwargs)
  File "/opt/odoo/odoo11/odoo/tools/lru.py", line 44, in __getitem__
    a = self.d[obj].me
KeyError: ('ir.model.access', <function IrModelAccess.check at 0x7f33603698c8>, 5, 'ir.ui.view', 'read', True, ('ar_SY',))

During handling of the above exception, another exception occurred:

Traceback (most recent call last):
  File "/opt/odoo/odoo11/odoo/addons/base/ir/ir_qweb/qweb.py", line 369, in get_template
    document = options.get('load', self.load)(template, options)
  File "/opt/odoo/odoo11/odoo/addons/base/ir/ir_qweb/ir_qweb.py", line 85, in load
    template = env['ir.ui.view'].read_template(name)
  File "/opt/odoo/odoo11/odoo/addons/base/ir/ir_ui_view.py", line 1103, in read_template
    return self._read_template(self.get_view_id(xml_id))
  File "<decorator-gen-160>", line 2, in get_view_id
  File "/opt/odoo/odoo11/odoo/tools/cache.py", line 89, in lookup
    value = d[key] = self.method(*args, **kwargs)
  File "/opt/odoo/odoo11/addons/website/models/ir_ui_view.py", line 87, in get_view_id
    view = self.search(domain, order='website_id', limit=1)
  File "/opt/odoo/odoo11/odoo/models.py", line 1480, in search
    res = self._search(args, offset=offset, limit=limit, order=order, count=count)
  File "/opt/odoo/odoo11/odoo/models.py", line 3767, in _search
    self.sudo(access_rights_uid or self._uid).check_access_rights('read')
  File "/opt/odoo/odoo11/odoo/models.py", line 2862, in check_access_rights
    return self.env['ir.model.access'].check(self._name, operation, raise_exception)
  File "<decorator-gen-20>", line 2, in check
  File "/opt/odoo/odoo11/odoo/tools/cache.py", line 89, in lookup
    value = d[key] = self.method(*args, **kwargs)
  File "/opt/odoo/odoo11/odoo/addons/base/ir/ir_model.py", line 1171, in check
    (model, self._uid,))
  File "/opt/odoo/odoo11/odoo/sql_db.py", line 154, in wrapper
    raise psycopg2.OperationalError(msg)
psycopg2.OperationalError: Unable to use a closed cursor.

During handling of the above exception, another exception occurred:

Traceback (most recent call last):
  File "/opt/odoo/odoo11/odoo/addons/base/ir/ir_http.py", line 208, in _dispatch
    result = request.dispatch()
  File "/opt/odoo/odoo11/odoo/http.py", line 829, in dispatch
    r = self._call_function(**self.params)
  File "/opt/odoo/odoo11/odoo/http.py", line 342, in _call_function
    return checked_call(self.db, *args, **kwargs)
  File "/opt/odoo/odoo11/odoo/service/model.py", line 97, in wrapper
    return f(dbname, *args, **kwargs)
  File "/opt/odoo/odoo11/odoo/http.py", line 338, in checked_call
    result.flatten()
  File "/opt/odoo/odoo11/odoo/http.py", line 1269, in flatten
    self.response.append(self.render())
  File "/opt/odoo/odoo11/odoo/http.py", line 1262, in render
    return env["ir.ui.view"].render_template(self.template, self.qcontext)
  File "/opt/odoo/odoo11/odoo/addons/base/ir/ir_ui_view.py", line 1208, in render_template
    return self.browse(self.get_view_id(template)).render(values, engine)
  File "/opt/odoo/odoo11/addons/website/models/ir_ui_view.py", line 113, in render
    return super(View, self).render(values, engine=engine)
  File "/opt/odoo/odoo11/addons/web_editor/models/ir_ui_view.py", line 27, in render
    return super(IrUiView, self).render(values=values, engine=engine)
  File "/opt/odoo/odoo11/odoo/addons/base/ir/ir_ui_view.py", line 1217, in render
    return self.env[engine].render(self.id, qcontext)
  File "/mnt/vdb/odoo/addons_runbot/runbot/static/build/09160-11-18-841b4b/addons/odoo_rtl/models/ir_qweb.py", line 20, in render
    return super(IrQWeb, self).render(id_or_xml_id, values=values, **options)
  File "/opt/odoo/odoo11/odoo/addons/base/ir/ir_qweb/ir_qweb.py", line 57, in render
    return super(IrQWeb, self).render(id_or_xml_id, values=values, **context)
  File "/opt/odoo/odoo11/odoo/addons/base/ir/ir_qweb/qweb.py", line 272, in render
    self.compile(template, options)(self, body.append, values or {})
  File "/opt/odoo/odoo11/odoo/addons/base/ir/ir_qweb/qweb.py", line 345, in _compiled_fn
    raise e
  File "/opt/odoo/odoo11/odoo/addons/base/ir/ir_qweb/qweb.py", line 343, in _compiled_fn
    return compiled(self, append, new, options, log)
  File "<template>", line 1, in template_1894_2332
  File "/opt/odoo/odoo11/odoo/addons/base/ir/ir_qweb/qweb.py", line 348, in _compiled_fn
    element, document = self.get_template(template, options)
  File "/opt/odoo/odoo11/odoo/addons/base/ir/ir_qweb/qweb.py", line 373, in get_template
    raise QWebException("load could not load template", name=template)
odoo.addons.base.ir.ir_qweb.qweb.QWebException: None
Traceback (most recent call last):
  File "/opt/odoo/odoo11/odoo/tools/cache.py", line 84, in lookup
    r = d[key]
  File "/opt/odoo/odoo11/odoo/tools/func.py", line 68, in wrapper
    return func(self, *args, **kwargs)
  File "/opt/odoo/odoo11/odoo/tools/lru.py", line 44, in __getitem__
    a = self.d[obj].me
KeyError: ('ir.qweb', <function IrQWeb._get_asset_nodes at 0x7f335b5c4268>, 'web.assets_frontend', 'ar_SY', True, False, None, False, False, (1,))

During handling of the above exception, another exception occurred:

Traceback (most recent call last):
  File "/opt/odoo/odoo11/odoo/addons/base/ir/ir_qweb/qweb.py", line 343, in _compiled_fn
    return compiled(self, append, new, options, log)
  File "<template>", line 1, in template_website_base_layout_2358
  File "<template>", line 2, in body_call_content_2357
  File "<template>", line 19, in set_2344
  File "<decorator-gen-39>", line 2, in _get_asset_nodes
  File "/opt/odoo/odoo11/odoo/tools/cache.py", line 89, in lookup
    value = d[key] = self.method(*args, **kwargs)
  File "/opt/odoo/odoo11/odoo/addons/base/ir/ir_qweb/ir_qweb.py", line 302, in _get_asset_nodes
    return remains + asset.to_node(css=css, js=js, debug=debug, async_load=async_load)
  File "/opt/odoo/odoo11/odoo/addons/base/ir/ir_qweb/assetsbundle.py", line 153, in to_node
    css_attachments = self.css() or []
  File "/opt/odoo/odoo11/odoo/addons/base/ir/ir_qweb/assetsbundle.py", line 310, in css
    self.save_attachment("css", ' '.join(page), inc=idx)
  File "/opt/odoo/odoo11/odoo/addons/base/ir/ir_qweb/assetsbundle.py", line 257, in save_attachment
    attachment = ira.sudo().create(values)
  File "/mnt/vdb/odoo/addons_runbot/runbot/static/build/09160-11-18-841b4b/addons/dms/models/ir_attachment.py", line 20, in create
    number_ir_attachment = self.env['ir.sequence'].next_by_code('ir.attachment.seq')
  File "/opt/odoo/odoo11/odoo/addons/base/ir/ir_sequence.py", line 282, in next_by_code
    seq_ids = self.search([('code', '=', sequence_code), ('company_id', 'in', [force_company, False])], order='company_id')
  File "/opt/odoo/odoo11/odoo/models.py", line 1480, in search
    res = self._search(args, offset=offset, limit=limit, order=order, count=count)
  File "/opt/odoo/odoo11/odoo/models.py", line 3791, in _search
    self._cr.execute(query_str, where_clause_params)
  File "/opt/odoo/odoo11/odoo/sql_db.py", line 154, in wrapper
    raise psycopg2.OperationalError(msg)
psycopg2.OperationalError: Unable to use a closed cursor.

During handling of the above exception, another exception occurred:

Traceback (most recent call last):
  File "/opt/odoo/odoo11/odoo/tools/cache.py", line 84, in lookup
    r = d[key]
  File "/opt/odoo/odoo11/odoo/tools/func.py", line 68, in wrapper
    return func(self, *args, **kwargs)
  File "/opt/odoo/odoo11/odoo/tools/lru.py", line 44, in __getitem__
    a = self.d[obj].me
KeyError: ('ir.ui.view', <function View.get_view_id at 0x7f3358b6e048>, 5, 'website_base.layout', (1,))

During handling of the above exception, another exception occurred:

Traceback (most recent call last):
  File "/opt/odoo/odoo11/odoo/tools/cache.py", line 84, in lookup
    r = d[key]
  File "/opt/odoo/odoo11/odoo/tools/func.py", line 68, in wrapper
    return func(self, *args, **kwargs)
  File "/opt/odoo/odoo11/odoo/tools/lru.py", line 44, in __getitem__
    a = self.d[obj].me
KeyError: ('ir.model.access', <function IrModelAccess.check at 0x7f33603698c8>, 5, 'ir.ui.view', 'read', True, ('ar_SY',))

During handling of the above exception, another exception occurred:

Traceback (most recent call last):
  File "/opt/odoo/odoo11/odoo/addons/base/ir/ir_qweb/qweb.py", line 369, in get_template
    document = options.get('load', self.load)(template, options)
  File "/opt/odoo/odoo11/odoo/addons/base/ir/ir_qweb/ir_qweb.py", line 85, in load
    template = env['ir.ui.view'].read_template(name)
  File "/opt/odoo/odoo11/odoo/addons/base/ir/ir_ui_view.py", line 1103, in read_template
    return self._read_template(self.get_view_id(xml_id))
  File "<decorator-gen-160>", line 2, in get_view_id
  File "/opt/odoo/odoo11/odoo/tools/cache.py", line 89, in lookup
    value = d[key] = self.method(*args, **kwargs)
  File "/opt/odoo/odoo11/addons/website/models/ir_ui_view.py", line 87, in get_view_id
    view = self.search(domain, order='website_id', limit=1)
  File "/opt/odoo/odoo11/odoo/models.py", line 1480, in search
    res = self._search(args, offset=offset, limit=limit, order=order, count=count)
  File "/opt/odoo/odoo11/odoo/models.py", line 3767, in _search
    self.sudo(access_rights_uid or self._uid).check_access_rights('read')
  File "/opt/odoo/odoo11/odoo/models.py", line 2862, in check_access_rights
    return self.env['ir.model.access'].check(self._name, operation, raise_exception)
  File "<decorator-gen-20>", line 2, in check
  File "/opt/odoo/odoo11/odoo/tools/cache.py", line 89, in lookup
    value = d[key] = self.method(*args, **kwargs)
  File "/opt/odoo/odoo11/odoo/addons/base/ir/ir_model.py", line 1171, in check
    (model, self._uid,))
  File "/opt/odoo/odoo11/odoo/sql_db.py", line 154, in wrapper
    raise psycopg2.OperationalError(msg)
psycopg2.OperationalError: Unable to use a closed cursor.

load could not load template
Template: website_base.layout
2019-03-13 18:51:31 ERROR server werkzeug:87 _log
Error on request:
Traceback (most recent call last):
  File "/usr/local/lib/python3.5/dist-packages/werkzeug/serving.py", line 209, in run_wsgi
    execute(self.server.app)
  File "/usr/local/lib/python3.5/dist-packages/werkzeug/serving.py", line 197, in execute
    application_iter = app(environ, start_response)
  File "/opt/odoo/odoo11/odoo/service/server.py", line 260, in app
    return self.app(e, s)
  File "/opt/odoo/odoo11/odoo/service/wsgi_server.py", line 166, in application
    return application_unproxied(environ, start_response)
  File "/opt/odoo/odoo11/odoo/service/wsgi_server.py", line 154, in application_unproxied
    result = handler(environ, start_response)
  File "/opt/odoo/odoo11/odoo/http.py", line 1318, in __call__
    return self.dispatch(environ, start_response)
  File "/opt/odoo/odoo11/odoo/http.py", line 1292, in __call__
    return self.app(environ, start_wrapped)
  File "/usr/local/lib/python3.5/dist-packages/werkzeug/wsgi.py", line 600, in __call__
    return self.app(environ, start_response)
  File "/opt/odoo/odoo11/odoo/http.py", line 1490, in dispatch
    result = ir_http._dispatch()
  File "/opt/odoo/odoo11/addons/auth_signup/models/ir_http.py", line 19, in _dispatch
    return super(Http, cls)._dispatch()
  File "/opt/odoo/odoo11/addons/web_editor/models/ir_http.py", line 22, in _dispatch
    return super(IrHttp, cls)._dispatch()
  File "/opt/odoo/odoo11/addons/http_routing/models/ir_http.py", line 393, in _dispatch
    result = super(IrHttp, cls)._dispatch()
  File "/opt/odoo/odoo11/addons/utm/models/ir_http.py", line 26, in _dispatch
    response = super(IrHttp, cls)._dispatch()
  File "/opt/odoo/odoo11/odoo/addons/base/ir/ir_http.py", line 212, in _dispatch
    return cls._handle_exception(e)
  File "/opt/odoo/odoo11/addons/website/models/ir_http.py", line 221, in _handle_exception
    if request.website.is_publisher() and isinstance(exception, werkzeug.exceptions.NotFound):
  File "/opt/odoo/odoo11/addons/website/models/website.py", line 400, in is_publisher
    return self.env['ir.model.access'].check('ir.ui.view', 'write', False)
  File "<decorator-gen-20>", line 2, in check
    
  File "/opt/odoo/odoo11/odoo/tools/cache.py", line 89, in lookup
    value = d[key] = self.method(*args, **kwargs)
  File "/opt/odoo/odoo11/odoo/addons/base/ir/ir_model.py", line 1171, in check
    (model, self._uid,))
  File "/opt/odoo/odoo11/odoo/sql_db.py", line 154, in wrapper
    raise psycopg2.OperationalError(msg)
psycopg2.OperationalError: Unable to use a closed cursor.
2019-03-13 18:51:34 ERROR server odoo.addons.website.models.ir_http:206 _handle_exception
500 Internal Server Error:

Traceback (most recent call last):
  File "/opt/odoo/odoo11/odoo/tools/cache.py", line 84, in lookup
    r = d[key]
  File "/opt/odoo/odoo11/odoo/tools/func.py", line 68, in wrapper
    return func(self, *args, **kwargs)
  File "/opt/odoo/odoo11/odoo/tools/lru.py", line 44, in __getitem__
    a = self.d[obj].me
KeyError: ('ir.qweb', <function IrQWeb._get_asset_nodes at 0x7f335b5c4268>, 'web.assets_frontend', 'ar_SY', True, False, None, False, False, (1,))

During handling of the above exception, another exception occurred:

Traceback (most recent call last):
  File "/opt/odoo/odoo11/odoo/tools/cache.py", line 84, in lookup
    r = d[key]
  File "/opt/odoo/odoo11/odoo/tools/func.py", line 68, in wrapper
    return func(self, *args, **kwargs)
  File "/opt/odoo/odoo11/odoo/tools/lru.py", line 44, in __getitem__
    a = self.d[obj].me
KeyError: ('ir.qweb', <function IrQWeb._get_asset_content at 0x7f335b5c4400>, 'web.assets_frontend', 'ar_SY', (1,))

During handling of the above exception, another exception occurred:

Traceback (most recent call last):
  File "/opt/odoo/odoo11/odoo/tools/cache.py", line 84, in lookup
    r = d[key]
  File "/opt/odoo/odoo11/odoo/tools/func.py", line 68, in wrapper
    return func(self, *args, **kwargs)
  File "/opt/odoo/odoo11/odoo/tools/lru.py", line 44, in __getitem__
    a = self.d[obj].me
KeyError: ('ir.qweb', <function IrQWeb.compile at 0x7f335b5b6b70>, 'web.assets_frontend', ('ar_SY', False, None, False, False, 1))

During handling of the above exception, another exception occurred:

Traceback (most recent call last):
  File "/opt/odoo/odoo11/odoo/tools/cache.py", line 84, in lookup
    r = d[key]
  File "/opt/odoo/odoo11/odoo/tools/func.py", line 68, in wrapper
    return func(self, *args, **kwargs)
  File "/opt/odoo/odoo11/odoo/tools/lru.py", line 44, in __getitem__
    a = self.d[obj].me
KeyError: ('ir.ui.view', <function View._read_template at 0x7f3360338268>, frozenset({1, 3, 4, 7, 8, 137, 29, 31, 32, 33, 34, 35, 36, 43, 44, 45, 46, 48, 52, 53, 58, 59, 60, 61, 64, 65, 68, 69, 71, 88, 89, 90, 91, 92, 93}), 399, ('ar_SY', False, None, False, False, 1))

During handling of the above exception, another exception occurred:

Traceback (most recent call last):
  File "/opt/odoo/odoo11/odoo/addons/base/ir/ir_qweb/qweb.py", line 369, in get_template
    document = options.get('load', self.load)(template, options)
  File "/opt/odoo/odoo11/odoo/addons/base/ir/ir_qweb/ir_qweb.py", line 85, in load
    template = env['ir.ui.view'].read_template(name)
  File "/opt/odoo/odoo11/odoo/addons/base/ir/ir_ui_view.py", line 1103, in read_template
    return self._read_template(self.get_view_id(xml_id))
  File "<decorator-gen-25>", line 2, in _read_template
  File "/opt/odoo/odoo11/odoo/tools/cache.py", line 89, in lookup
    value = d[key] = self.method(*args, **kwargs)
  File "/opt/odoo/odoo11/odoo/addons/base/ir/ir_ui_view.py", line 1094, in _read_template
    arch = self.browse(view_id).read_combined(['arch'])['arch']
  File "/opt/odoo/odoo11/odoo/addons/base/ir/ir_ui_view.py", line 727, in read_combined
    arch = self.apply_view_inheritance(arch_tree, root.id, self.model)
  File "/opt/odoo/odoo11/odoo/addons/base/ir/ir_ui_view.py", line 677, in apply_view_inheritance
    source = self.apply_view_inheritance(source, view_id, model, root_id=root_id)
  File "/opt/odoo/odoo11/odoo/addons/base/ir/ir_ui_view.py", line 677, in apply_view_inheritance
    source = self.apply_view_inheritance(source, view_id, model, root_id=root_id)
  File "/opt/odoo/odoo11/odoo/addons/base/ir/ir_ui_view.py", line 671, in apply_view_inheritance
    sql_inherit = self.get_inheriting_views_arch(source_id, model)
  File "/opt/odoo/odoo11/odoo/addons/base/ir/ir_ui_view.py", line 492, in get_inheriting_views_arch
    views = self.search(conditions, order=INHERIT_ORDER)
  File "/opt/odoo/odoo11/odoo/models.py", line 1480, in search
    res = self._search(args, offset=offset, limit=limit, order=order, count=count)
  File "/opt/odoo/odoo11/odoo/models.py", line 3792, in _search
    res = self._cr.fetchall()
  File "/opt/odoo/odoo11/odoo/sql_db.py", line 154, in wrapper
    raise psycopg2.OperationalError(msg)
psycopg2.OperationalError: Unable to use a closed cursor.

During handling of the above exception, another exception occurred:

Traceback (most recent call last):
  File "/opt/odoo/odoo11/odoo/addons/base/ir/ir_http.py", line 208, in _dispatch
    result = request.dispatch()
  File "/opt/odoo/odoo11/odoo/http.py", line 829, in dispatch
    r = self._call_function(**self.params)
  File "/opt/odoo/odoo11/odoo/http.py", line 342, in _call_function
    return checked_call(self.db, *args, **kwargs)
  File "/opt/odoo/odoo11/odoo/service/model.py", line 97, in wrapper
    return f(dbname, *args, **kwargs)
  File "/opt/odoo/odoo11/odoo/http.py", line 338, in checked_call
    result.flatten()
  File "/opt/odoo/odoo11/odoo/http.py", line 1269, in flatten
    self.response.append(self.render())
  File "/opt/odoo/odoo11/odoo/http.py", line 1262, in render
    return env["ir.ui.view"].render_template(self.template, self.qcontext)
  File "/opt/odoo/odoo11/odoo/addons/base/ir/ir_ui_view.py", line 1208, in render_template
    return self.browse(self.get_view_id(template)).render(values, engine)
  File "/opt/odoo/odoo11/addons/website/models/ir_ui_view.py", line 113, in render
    return super(View, self).render(values, engine=engine)
  File "/opt/odoo/odoo11/addons/web_editor/models/ir_ui_view.py", line 27, in render
    return super(IrUiView, self).render(values=values, engine=engine)
  File "/opt/odoo/odoo11/odoo/addons/base/ir/ir_ui_view.py", line 1217, in render
    return self.env[engine].render(self.id, qcontext)
  File "/mnt/vdb/odoo/addons_runbot/runbot/static/build/09160-11-18-841b4b/addons/odoo_rtl/models/ir_qweb.py", line 20, in render
    return super(IrQWeb, self).render(id_or_xml_id, values=values, **options)
  File "/opt/odoo/odoo11/odoo/addons/base/ir/ir_qweb/ir_qweb.py", line 57, in render
    return super(IrQWeb, self).render(id_or_xml_id, values=values, **context)
  File "/opt/odoo/odoo11/odoo/addons/base/ir/ir_qweb/qweb.py", line 272, in render
    self.compile(template, options)(self, body.append, values or {})
  File "/opt/odoo/odoo11/odoo/addons/base/ir/ir_qweb/qweb.py", line 345, in _compiled_fn
    raise e
  File "/opt/odoo/odoo11/odoo/addons/base/ir/ir_qweb/qweb.py", line 343, in _compiled_fn
    return compiled(self, append, new, options, log)
  File "<template>", line 1, in template_1894_2409
  File "/opt/odoo/odoo11/odoo/addons/base/ir/ir_qweb/qweb.py", line 345, in _compiled_fn
    raise e
  File "/opt/odoo/odoo11/odoo/addons/base/ir/ir_qweb/qweb.py", line 343, in _compiled_fn
    return compiled(self, append, new, options, log)
  File "<template>", line 1, in template_website_base_layout_2435
  File "<template>", line 2, in body_call_content_2434
  File "<template>", line 19, in set_2421
  File "<decorator-gen-39>", line 2, in _get_asset_nodes
  File "/opt/odoo/odoo11/odoo/tools/cache.py", line 89, in lookup
    value = d[key] = self.method(*args, **kwargs)
  File "/opt/odoo/odoo11/odoo/addons/base/ir/ir_qweb/ir_qweb.py", line 299, in _get_asset_nodes
    files, remains = self._get_asset_content(xmlid, options)
  File "<decorator-gen-40>", line 2, in _get_asset_content
  File "/opt/odoo/odoo11/odoo/tools/cache.py", line 89, in lookup
    value = d[key] = self.method(*args, **kwargs)
  File "/opt/odoo/odoo11/odoo/addons/base/ir/ir_qweb/ir_qweb.py", line 324, in _get_asset_content
    template = env['ir.qweb'].render(xmlid, {"get_modules_order": get_modules_order})
  File "/mnt/vdb/odoo/addons_runbot/runbot/static/build/09160-11-18-841b4b/addons/odoo_rtl/models/ir_qweb.py", line 20, in render
    return super(IrQWeb, self).render(id_or_xml_id, values=values, **options)
  File "/opt/odoo/odoo11/odoo/addons/base/ir/ir_qweb/ir_qweb.py", line 57, in render
    return super(IrQWeb, self).render(id_or_xml_id, values=values, **context)
  File "/opt/odoo/odoo11/odoo/addons/base/ir/ir_qweb/qweb.py", line 272, in render
    self.compile(template, options)(self, body.append, values or {})
  File "<decorator-gen-37>", line 2, in compile
  File "/opt/odoo/odoo11/odoo/tools/cache.py", line 89, in lookup
    value = d[key] = self.method(*args, **kwargs)
  File "/opt/odoo/odoo11/odoo/addons/base/ir/ir_qweb/ir_qweb.py", line 77, in compile
    return super(IrQWeb, self).compile(id_or_xml_id, options=options)
  File "/opt/odoo/odoo11/odoo/addons/base/ir/ir_qweb/qweb.py", line 289, in compile
    element, document = self.get_template(template, options)
  File "/opt/odoo/odoo11/odoo/addons/base/ir/ir_qweb/qweb.py", line 373, in get_template
    raise QWebException("load could not load template", name=template)
odoo.addons.base.ir.ir_qweb.qweb.QWebException: None
Traceback (most recent call last):
  File "/opt/odoo/odoo11/odoo/tools/cache.py", line 84, in lookup
    r = d[key]
  File "/opt/odoo/odoo11/odoo/tools/func.py", line 68, in wrapper
    return func(self, *args, **kwargs)
  File "/opt/odoo/odoo11/odoo/tools/lru.py", line 44, in __getitem__
    a = self.d[obj].me
KeyError: ('ir.qweb', <function IrQWeb._get_asset_nodes at 0x7f335b5c4268>, 'web.assets_frontend', 'ar_SY', True, False, None, False, False, (1,))

During handling of the above exception, another exception occurred:

Traceback (most recent call last):
  File "/opt/odoo/odoo11/odoo/tools/cache.py", line 84, in lookup
    r = d[key]
  File "/opt/odoo/odoo11/odoo/tools/func.py", line 68, in wrapper
    return func(self, *args, **kwargs)
  File "/opt/odoo/odoo11/odoo/tools/lru.py", line 44, in __getitem__
    a = self.d[obj].me
KeyError: ('ir.qweb', <function IrQWeb._get_asset_content at 0x7f335b5c4400>, 'web.assets_frontend', 'ar_SY', (1,))

During handling of the above exception, another exception occurred:

Traceback (most recent call last):
  File "/opt/odoo/odoo11/odoo/tools/cache.py", line 84, in lookup
    r = d[key]
  File "/opt/odoo/odoo11/odoo/tools/func.py", line 68, in wrapper
    return func(self, *args, **kwargs)
  File "/opt/odoo/odoo11/odoo/tools/lru.py", line 44, in __getitem__
    a = self.d[obj].me
KeyError: ('ir.qweb', <function IrQWeb.compile at 0x7f335b5b6b70>, 'web.assets_frontend', ('ar_SY', False, None, False, False, 1))

During handling of the above exception, another exception occurred:

Traceback (most recent call last):
  File "/opt/odoo/odoo11/odoo/tools/cache.py", line 84, in lookup
    r = d[key]
  File "/opt/odoo/odoo11/odoo/tools/func.py", line 68, in wrapper
    return func(self, *args, **kwargs)
  File "/opt/odoo/odoo11/odoo/tools/lru.py", line 44, in __getitem__
    a = self.d[obj].me
KeyError: ('ir.ui.view', <function View._read_template at 0x7f3360338268>, frozenset({1, 3, 4, 7, 8, 137, 29, 31, 32, 33, 34, 35, 36, 43, 44, 45, 46, 48, 52, 53, 58, 59, 60, 61, 64, 65, 68, 69, 71, 88, 89, 90, 91, 92, 93}), 399, ('ar_SY', False, None, False, False, 1))

During handling of the above exception, another exception occurred:

Traceback (most recent call last):
  File "/opt/odoo/odoo11/odoo/addons/base/ir/ir_qweb/qweb.py", line 369, in get_template
    document = options.get('load', self.load)(template, options)
  File "/opt/odoo/odoo11/odoo/addons/base/ir/ir_qweb/ir_qweb.py", line 85, in load
    template = env['ir.ui.view'].read_template(name)
  File "/opt/odoo/odoo11/odoo/addons/base/ir/ir_ui_view.py", line 1103, in read_template
    return self._read_template(self.get_view_id(xml_id))
  File "<decorator-gen-25>", line 2, in _read_template
  File "/opt/odoo/odoo11/odoo/tools/cache.py", line 89, in lookup
    value = d[key] = self.method(*args, **kwargs)
  File "/opt/odoo/odoo11/odoo/addons/base/ir/ir_ui_view.py", line 1094, in _read_template
    arch = self.browse(view_id).read_combined(['arch'])['arch']
  File "/opt/odoo/odoo11/odoo/addons/base/ir/ir_ui_view.py", line 727, in read_combined
    arch = self.apply_view_inheritance(arch_tree, root.id, self.model)
  File "/opt/odoo/odoo11/odoo/addons/base/ir/ir_ui_view.py", line 677, in apply_view_inheritance
    source = self.apply_view_inheritance(source, view_id, model, root_id=root_id)
  File "/opt/odoo/odoo11/odoo/addons/base/ir/ir_ui_view.py", line 677, in apply_view_inheritance
    source = self.apply_view_inheritance(source, view_id, model, root_id=root_id)
  File "/opt/odoo/odoo11/odoo/addons/base/ir/ir_ui_view.py", line 671, in apply_view_inheritance
    sql_inherit = self.get_inheriting_views_arch(source_id, model)
  File "/opt/odoo/odoo11/odoo/addons/base/ir/ir_ui_view.py", line 492, in get_inheriting_views_arch
    views = self.search(conditions, order=INHERIT_ORDER)
  File "/opt/odoo/odoo11/odoo/models.py", line 1480, in search
    res = self._search(args, offset=offset, limit=limit, order=order, count=count)
  File "/opt/odoo/odoo11/odoo/models.py", line 3792, in _search
    res = self._cr.fetchall()
  File "/opt/odoo/odoo11/odoo/sql_db.py", line 154, in wrapper
    raise psycopg2.OperationalError(msg)
psycopg2.OperationalError: Unable to use a closed cursor.

load could not load template
Template: web.assets_frontend
2019-03-13 18:51:34 ERROR server odoo.addons.website.tests.test_crawl:474 write ERROR
2019-03-13 18:51:34 ERROR server odoo.addons.website.tests.test_crawl:474 write ERROR: test_10_crawl_public (odoo.addons.website.tests.test_crawl.Crawler)
2019-03-13 18:51:34 ERROR server odoo.addons.website.tests.test_crawl:474 write Traceback (most recent call last):
2019-03-13 18:51:34 ERROR server odoo.addons.website.tests.test_crawl:474 write ` File "/usr/lib/python3/dist-packages/urllib3/connectionpool.py", line 377, in _make_request
2019-03-13 18:51:34 ERROR server odoo.addons.website.tests.test_crawl:474 write ` httplib_response = conn.getresponse(buffering=True)
2019-03-13 18:51:34 ERROR server odoo.addons.website.tests.test_crawl:474 write ` TypeError: getresponse() got an unexpected keyword argument 'buffering'
2019-03-13 18:51:34 ERROR server odoo.addons.website.tests.test_crawl:474 write `
2019-03-13 18:51:34 ERROR server odoo.addons.website.tests.test_crawl:474 write ` During handling of the above exception, another exception occurred:
2019-03-13 18:51:34 ERROR server odoo.addons.website.tests.test_crawl:474 write `
2019-03-13 18:51:34 ERROR server odoo.addons.website.tests.test_crawl:474 write ` Traceback (most recent call last):
2019-03-13 18:51:34 ERROR server odoo.addons.website.tests.test_crawl:474 write ` File "/usr/lib/python3/dist-packages/urllib3/connectionpool.py", line 379, in _make_request
2019-03-13 18:51:34 ERROR server odoo.addons.website.tests.test_crawl:474 write ` httplib_response = conn.getresponse()
2019-03-13 18:51:34 ERROR server odoo.addons.website.tests.test_crawl:474 write ` File "/usr/lib/python3.5/http/client.py", line 1197, in getresponse
2019-03-13 18:51:34 ERROR server odoo.addons.website.tests.test_crawl:474 write ` response.begin()
2019-03-13 18:51:34 ERROR server odoo.addons.website.tests.test_crawl:474 write ` File "/usr/lib/python3.5/http/client.py", line 297, in begin
2019-03-13 18:51:34 ERROR server odoo.addons.website.tests.test_crawl:474 write ` version, status, reason = self._read_status()
2019-03-13 18:51:34 ERROR server odoo.addons.website.tests.test_crawl:474 write ` File "/usr/lib/python3.5/http/client.py", line 258, in _read_status
2019-03-13 18:51:34 ERROR server odoo.addons.website.tests.test_crawl:474 write ` line = str(self.fp.readline(_MAXLINE + 1), "iso-8859-1")
2019-03-13 18:51:34 ERROR server odoo.addons.website.tests.test_crawl:474 write ` File "/usr/lib/python3.5/socket.py", line 575, in readinto
2019-03-13 18:51:34 ERROR server odoo.addons.website.tests.test_crawl:474 write ` return self._sock.recv_into(b)
2019-03-13 18:51:34 ERROR server odoo.addons.website.tests.test_crawl:474 write ` socket.timeout: timed out
2019-03-13 18:51:34 ERROR server odoo.addons.website.tests.test_crawl:474 write `
2019-03-13 18:51:34 ERROR server odoo.addons.website.tests.test_crawl:474 write ` During handling of the above exception, another exception occurred:
2019-03-13 18:51:34 ERROR server odoo.addons.website.tests.test_crawl:474 write `
2019-03-13 18:51:34 ERROR server odoo.addons.website.tests.test_crawl:474 write ` Traceback (most recent call last):
2019-03-13 18:51:34 ERROR server odoo.addons.website.tests.test_crawl:474 write ` File "/usr/lib/python3/dist-packages/requests/adapters.py", line 376, in send
2019-03-13 18:51:34 ERROR server odoo.addons.website.tests.test_crawl:474 write ` timeout=timeout
2019-03-13 18:51:34 ERROR server odoo.addons.website.tests.test_crawl:474 write ` File "/usr/lib/python3/dist-packages/urllib3/connectionpool.py", line 610, in urlopen
2019-03-13 18:51:34 ERROR server odoo.addons.website.tests.test_crawl:474 write ` _stacktrace=sys.exc_info()[2])
2019-03-13 18:51:34 ERROR server odoo.addons.website.tests.test_crawl:474 write ` File "/usr/lib/python3/dist-packages/urllib3/util/retry.py", line 247, in increment
2019-03-13 18:51:34 ERROR server odoo.addons.website.tests.test_crawl:474 write ` raise six.reraise(type(error), error, _stacktrace)
2019-03-13 18:51:34 ERROR server odoo.addons.website.tests.test_crawl:474 write ` File "/usr/lib/python3/dist-packages/six.py", line 686, in reraise
2019-03-13 18:51:34 ERROR server werkzeug:87 _log
Error on request:
Traceback (most recent call last):
  File "/usr/local/lib/python3.5/dist-packages/werkzeug/serving.py", line 209, in run_wsgi
    execute(self.server.app)
  File "/usr/local/lib/python3.5/dist-packages/werkzeug/serving.py", line 197, in execute
    application_iter = app(environ, start_response)
  File "/opt/odoo/odoo11/odoo/service/server.py", line 260, in app
    return self.app(e, s)
  File "/opt/odoo/odoo11/odoo/service/wsgi_server.py", line 166, in application
    return application_unproxied(environ, start_response)
  File "/opt/odoo/odoo11/odoo/service/wsgi_server.py", line 154, in application_unproxied
    result = handler(environ, start_response)
  File "/opt/odoo/odoo11/odoo/http.py", line 1318, in __call__
    return self.dispatch(environ, start_response)
  File "/opt/odoo/odoo11/odoo/http.py", line 1292, in __call__
    return self.app(environ, start_wrapped)
  File "/usr/local/lib/python3.5/dist-packages/werkzeug/wsgi.py", line 600, in __call__
    return self.app(environ, start_response)
  File "/opt/odoo/odoo11/odoo/http.py", line 1490, in dispatch
    result = ir_http._dispatch()
  File "/opt/odoo/odoo11/addons/auth_signup/models/ir_http.py", line 19, in _dispatch
    return super(Http, cls)._dispatch()
  File "/opt/odoo/odoo11/addons/web_editor/models/ir_http.py", line 22, in _dispatch
    return super(IrHttp, cls)._dispatch()
  File "/opt/odoo/odoo11/addons/http_routing/models/ir_http.py", line 393, in _dispatch
    result = super(IrHttp, cls)._dispatch()
  File "/opt/odoo/odoo11/addons/utm/models/ir_http.py", line 26, in _dispatch
    response = super(IrHttp, cls)._dispatch()
  File "/opt/odoo/odoo11/odoo/addons/base/ir/ir_http.py", line 212, in _dispatch
    return cls._handle_exception(e)
  File "/opt/odoo/odoo11/addons/website/models/ir_http.py", line 231, in _handle_exception
    html = request.env['ir.ui.view'].render_template('website.http_error', values)
  File "/opt/odoo/odoo11/odoo/addons/base/ir/ir_ui_view.py", line 1208, in render_template
    return self.browse(self.get_view_id(template)).render(values, engine)
  File "<decorator-gen-160>", line 2, in get_view_id
    
  File "/opt/odoo/odoo11/odoo/tools/cache.py", line 89, in lookup
    value = d[key] = self.method(*args, **kwargs)
  File "/opt/odoo/odoo11/addons/website/models/ir_ui_view.py", line 87, in get_view_id
    view = self.search(domain, order='website_id', limit=1)
  File "/opt/odoo/odoo11/odoo/models.py", line 1480, in search
    res = self._search(args, offset=offset, limit=limit, order=order, count=count)
  File "/opt/odoo/odoo11/odoo/models.py", line 3791, in _search
    self._cr.execute(query_str, where_clause_params)
  File "/opt/odoo/odoo11/odoo/sql_db.py", line 154, in wrapper
    raise psycopg2.OperationalError(msg)
psycopg2.OperationalError: Unable to use a closed cursor.
2019-03-13 18:51:34 ERROR server odoo.addons.website.tests.test_crawl:474 write ` raise value
2019-03-13 18:51:34 ERROR server odoo.addons.website.tests.test_crawl:474 write ` File "/usr/lib/python3/dist-packages/urllib3/connectionpool.py", line 560, in urlopen
2019-03-13 18:51:34 ERROR server odoo.addons.website.tests.test_crawl:474 write ` body=body, headers=headers)
2019-03-13 18:51:34 ERROR server odoo.addons.website.tests.test_crawl:474 write ` File "/usr/lib/python3/dist-packages/urllib3/connectionpool.py", line 381, in _make_request
2019-03-13 18:51:34 ERROR server odoo.addons.website.tests.test_crawl:474 write ` self._raise_timeout(err=e, url=url, timeout_value=read_timeout)
2019-03-13 18:51:34 ERROR server odoo.addons.website.tests.test_crawl:474 write ` File "/usr/lib/python3/dist-packages/urllib3/connectionpool.py", line 309, in _raise_timeout
2019-03-13 18:51:34 ERROR server odoo.addons.website.tests.test_crawl:474 write ` raise ReadTimeoutError(self, url, "Read timed out. (read timeout=%s)" % timeout_value)
2019-03-13 18:51:34 ERROR server odoo.addons.website.tests.test_crawl:474 write ` requests.packages.urllib3.exceptions.ReadTimeoutError: HTTPConnectionPool(host='127.0.0.1', port=2032): Read timed out. (read timeout=10)
2019-03-13 18:51:34 ERROR server odoo.addons.website.tests.test_crawl:474 write `
2019-03-13 18:51:34 ERROR server odoo.addons.website.tests.test_crawl:474 write ` During handling of the above exception, another exception occurred:
2019-03-13 18:51:34 ERROR server odoo.addons.website.tests.test_crawl:474 write `
2019-03-13 18:51:34 ERROR server odoo.addons.website.tests.test_crawl:474 write ` Traceback (most recent call last):
2019-03-13 18:51:34 ERROR server odoo.addons.website.tests.test_crawl:474 write ` File "/opt/odoo/odoo11/addons/website/tests/test_crawl.py", line 69, in test_10_crawl_public
2019-03-13 18:51:34 ERROR server odoo.addons.website.tests.test_crawl:474 write ` seen = self.crawl('/', msg='Anonymous Coward')
2019-03-13 18:51:34 ERROR server odoo.addons.website.tests.test_crawl:474 write ` File "/opt/odoo/odoo11/addons/website/tests/test_crawl.py", line 41, in crawl
2019-03-13 18:51:34 ERROR server odoo.addons.website.tests.test_crawl:474 write ` r = self.url_open(url)
2019-03-13 18:51:34 ERROR server odoo.addons.website.tests.test_crawl:474 write ` File "/opt/odoo/odoo11/odoo/tests/common.py", line 281, in url_open
2019-03-13 18:51:34 ERROR server odoo.addons.website.tests.test_crawl:474 write ` return self.opener.get(url, timeout=timeout)
2019-03-13 18:51:34 ERROR server odoo.addons.website.tests.test_crawl:474 write ` File "/usr/lib/python3/dist-packages/requests/sessions.py", line 492, in get
2019-03-13 18:51:34 ERROR server odoo.addons.website.tests.test_crawl:474 write ` return self.request('GET', url, **kwargs)
2019-03-13 18:51:34 ERROR server odoo.addons.website.tests.test_crawl:474 write ` File "/usr/lib/python3/dist-packages/requests/sessions.py", line 480, in request
2019-03-13 18:51:34 ERROR server odoo.addons.website.tests.test_crawl:474 write ` resp = self.send(prep, **send_kwargs)
2019-03-13 18:51:34 ERROR server odoo.addons.website.tests.test_crawl:474 write ` File "/usr/lib/python3/dist-packages/requests/sessions.py", line 609, in send
2019-03-13 18:51:34 ERROR server odoo.addons.website.tests.test_crawl:474 write ` history = [resp for resp in gen] if allow_redirects else []
2019-03-13 18:51:34 ERROR server odoo.addons.website.tests.test_crawl:474 write ` File "/usr/lib/python3/dist-packages/requests/sessions.py", line 609, in <listcomp>
2019-03-13 18:51:34 ERROR server odoo.addons.website.tests.test_crawl:474 write ` history = [resp for resp in gen] if allow_redirects else []
2019-03-13 18:51:34 ERROR server odoo.addons.website.tests.test_crawl:474 write ` File "/usr/lib/python3/dist-packages/requests/sessions.py", line 211, in resolve_redirects
2019-03-13 18:51:34 ERROR server odoo.addons.website.tests.test_crawl:474 write ` **adapter_kwargs
2019-03-13 18:51:34 ERROR server odoo.addons.website.tests.test_crawl:474 write ` File "/usr/lib/python3/dist-packages/requests/sessions.py", line 588, in send
2019-03-13 18:51:34 ERROR server odoo.addons.website.tests.test_crawl:474 write ` r = adapter.send(request, **kwargs)
2019-03-13 18:51:34 ERROR server odoo.addons.website.tests.test_crawl:474 write ` File "/usr/lib/python3/dist-packages/requests/adapters.py", line 449, in send
2019-03-13 18:51:34 ERROR server odoo.addons.website.tests.test_crawl:474 write ` raise ReadTimeout(e, request=request)
2019-03-13 18:51:34 ERROR server odoo.addons.website.tests.test_crawl:474 write ` requests.exceptions.ReadTimeout: HTTPConnectionPool(host='127.0.0.1', port=2032): Read timed out. (read timeout=10)
2019-03-13 18:51:34 ERROR server odoo.addons.website.tests.test_crawl:474 write ERROR: test_20_crawl_demo (odoo.addons.website.tests.test_crawl.Crawler)
2019-03-13 18:51:34 ERROR server odoo.addons.website.tests.test_crawl:474 write Traceback (most recent call last):
2019-03-13 18:51:34 ERROR server odoo.addons.website.tests.test_crawl:474 write ` File "/usr/lib/python3/dist-packages/urllib3/connectionpool.py", line 377, in _make_request
2019-03-13 18:51:34 ERROR server odoo.addons.website.tests.test_crawl:474 write ` httplib_response = conn.getresponse(buffering=True)
2019-03-13 18:51:34 ERROR server odoo.addons.website.tests.test_crawl:474 write ` TypeError: getresponse() got an unexpected keyword argument 'buffering'
2019-03-13 18:51:34 ERROR server odoo.addons.website.tests.test_crawl:474 write `
2019-03-13 18:51:34 ERROR server odoo.addons.website.tests.test_crawl:474 write ` During handling of the above exception, another exception occurred:
2019-03-13 18:51:34 ERROR server odoo.addons.website.tests.test_crawl:474 write `
2019-03-13 18:51:34 ERROR server odoo.addons.website.tests.test_crawl:474 write ` Traceback (most recent call last):
2019-03-13 18:51:34 ERROR server odoo.addons.website.tests.test_crawl:474 write ` File "/usr/lib/python3/dist-packages/urllib3/connectionpool.py", line 379, in _make_request
2019-03-13 18:51:34 ERROR server odoo.addons.website.tests.test_crawl:474 write ` httplib_response = conn.getresponse()
2019-03-13 18:51:34 ERROR server odoo.addons.website.tests.test_crawl:474 write ` File "/usr/lib/python3.5/http/client.py", line 1197, in getresponse
2019-03-13 18:51:34 ERROR server odoo.addons.website.tests.test_crawl:474 write ` response.begin()
2019-03-13 18:51:34 ERROR server odoo.addons.website.tests.test_crawl:474 write ` File "/usr/lib/python3.5/http/client.py", line 297, in begin
2019-03-13 18:51:34 ERROR server odoo.addons.website.tests.test_crawl:474 write ` version, status, reason = self._read_status()
2019-03-13 18:51:34 ERROR server odoo.addons.website.tests.test_crawl:474 write ` File "/usr/lib/python3.5/http/client.py", line 258, in _read_status
2019-03-13 18:51:34 ERROR server odoo.addons.website.tests.test_crawl:474 write ` line = str(self.fp.readline(_MAXLINE + 1), "iso-8859-1")
2019-03-13 18:51:34 ERROR server odoo.addons.website.tests.test_crawl:474 write ` File "/usr/lib/python3.5/socket.py", line 575, in readinto
2019-03-13 18:51:34 ERROR server odoo.addons.website.tests.test_crawl:474 write ` return self._sock.recv_into(b)
2019-03-13 18:51:34 ERROR server odoo.addons.website.tests.test_crawl:474 write ` socket.timeout: timed out
2019-03-13 18:51:34 ERROR server odoo.addons.website.tests.test_crawl:474 write `
2019-03-13 18:51:34 ERROR server odoo.addons.website.tests.test_crawl:474 write ` During handling of the above exception, another exception occurred:
2019-03-13 18:51:34 ERROR server odoo.addons.website.tests.test_crawl:474 write `
2019-03-13 18:51:34 ERROR server odoo.addons.website.tests.test_crawl:474 write ` Traceback (most recent call last):
2019-03-13 18:51:34 ERROR server odoo.addons.website.tests.test_crawl:474 write ` File "/usr/lib/python3/dist-packages/requests/adapters.py", line 376, in send
2019-03-13 18:51:34 ERROR server odoo.addons.website.tests.test_crawl:474 write ` timeout=timeout
2019-03-13 18:51:34 ERROR server odoo.addons.website.tests.test_crawl:474 write ` File "/usr/lib/python3/dist-packages/urllib3/connectionpool.py", line 610, in urlopen
2019-03-13 18:51:34 ERROR server odoo.addons.website.tests.test_crawl:474 write ` _stacktrace=sys.exc_info()[2])
2019-03-13 18:51:34 ERROR server odoo.addons.website.tests.test_crawl:474 write ` File "/usr/lib/python3/dist-packages/urllib3/util/retry.py", line 247, in increment
2019-03-13 18:51:34 ERROR server odoo.addons.website.tests.test_crawl:474 write ` raise six.reraise(type(error), error, _stacktrace)
2019-03-13 18:51:34 ERROR server odoo.addons.website.tests.test_crawl:474 write ` File "/usr/lib/python3/dist-packages/six.py", line 686, in reraise
2019-03-13 18:51:34 ERROR server odoo.addons.website.tests.test_crawl:474 write ` raise value
2019-03-13 18:51:34 ERROR server odoo.addons.website.tests.test_crawl:474 write ` File "/usr/lib/python3/dist-packages/urllib3/connectionpool.py", line 560, in urlopen
2019-03-13 18:51:34 ERROR server odoo.addons.website.tests.test_crawl:474 write ` body=body, headers=headers)
2019-03-13 18:51:34 ERROR server odoo.addons.website.tests.test_crawl:474 write ` File "/usr/lib/python3/dist-packages/urllib3/connectionpool.py", line 381, in _make_request
2019-03-13 18:51:34 ERROR server odoo.addons.website.tests.test_crawl:474 write ` self._raise_timeout(err=e, url=url, timeout_value=read_timeout)
2019-03-13 18:51:34 ERROR server odoo.addons.website.tests.test_crawl:474 write ` File "/usr/lib/python3/dist-packages/urllib3/connectionpool.py", line 309, in _raise_timeout
2019-03-13 18:51:34 ERROR server odoo.addons.website.tests.test_crawl:474 write ` raise ReadTimeoutError(self, url, "Read timed out. (read timeout=%s)" % timeout_value)
2019-03-13 18:51:34 ERROR server odoo.addons.website.tests.test_crawl:474 write ` requests.packages.urllib3.exceptions.ReadTimeoutError: HTTPConnectionPool(host='127.0.0.1', port=2032): Read timed out. (read timeout=10)
2019-03-13 18:51:34 ERROR server odoo.addons.website.tests.test_crawl:474 write `
2019-03-13 18:51:34 ERROR server odoo.addons.website.tests.test_crawl:474 write ` During handling of the above exception, another exception occurred:
2019-03-13 18:51:34 ERROR server odoo.addons.website.tests.test_crawl:474 write `
2019-03-13 18:51:34 ERROR server odoo.addons.website.tests.test_crawl:474 write ` Traceback (most recent call last):
2019-03-13 18:51:34 ERROR server odoo.addons.website.tests.test_crawl:474 write ` File "/opt/odoo/odoo11/addons/website/tests/test_crawl.py", line 79, in test_20_crawl_demo
2019-03-13 18:51:34 ERROR server odoo.addons.website.tests.test_crawl:474 write ` seen = self.crawl('/', msg='demo')
2019-03-13 18:51:34 ERROR server odoo.addons.website.tests.test_crawl:474 write ` File "/opt/odoo/odoo11/addons/website/tests/test_crawl.py", line 41, in crawl
2019-03-13 18:51:34 ERROR server odoo.addons.website.tests.test_crawl:474 write ` r = self.url_open(url)
2019-03-13 18:51:34 ERROR server odoo.addons.website.tests.test_crawl:474 write ` File "/opt/odoo/odoo11/odoo/tests/common.py", line 281, in url_open
2019-03-13 18:51:34 ERROR server odoo.addons.website.tests.test_crawl:474 write ` return self.opener.get(url, timeout=timeout)
2019-03-13 18:51:34 ERROR server odoo.addons.website.tests.test_crawl:474 write ` File "/usr/lib/python3/dist-packages/requests/sessions.py", line 492, in get
2019-03-13 18:51:34 ERROR server odoo.addons.website.tests.test_crawl:474 write ` return self.request('GET', url, **kwargs)
2019-03-13 18:51:34 ERROR server odoo.addons.website.tests.test_crawl:474 write ` File "/usr/lib/python3/dist-packages/requests/sessions.py", line 480, in request
2019-03-13 18:51:34 ERROR server odoo.addons.website.tests.test_crawl:474 write ` resp = self.send(prep, **send_kwargs)
2019-03-13 18:51:34 ERROR server odoo.addons.website.tests.test_crawl:474 write ` File "/usr/lib/python3/dist-packages/requests/sessions.py", line 588, in send
2019-03-13 18:51:34 ERROR server odoo.addons.website.tests.test_crawl:474 write ` r = adapter.send(request, **kwargs)
2019-03-13 18:51:34 ERROR server odoo.addons.website.tests.test_crawl:474 write ` File "/usr/lib/python3/dist-packages/requests/adapters.py", line 449, in send
2019-03-13 18:51:34 ERROR server odoo.addons.website.tests.test_crawl:474 write ` raise ReadTimeout(e, request=request)
2019-03-13 18:51:34 ERROR server odoo.addons.website.tests.test_crawl:474 write ` requests.exceptions.ReadTimeout: HTTPConnectionPool(host='127.0.0.1', port=2032): Read timed out. (read timeout=10)
2019-03-13 18:51:34 ERROR server odoo.addons.website.tests.test_crawl:474 write ERROR: test_30_crawl_admin (odoo.addons.website.tests.test_crawl.Crawler)
2019-03-13 18:51:34 ERROR server odoo.addons.website.tests.test_crawl:474 write Traceback (most recent call last):
2019-03-13 18:51:34 ERROR server odoo.addons.website.tests.test_crawl:474 write ` File "/usr/lib/python3/dist-packages/urllib3/connectionpool.py", line 377, in _make_request
2019-03-13 18:51:34 ERROR server odoo.addons.website.tests.test_crawl:474 write ` httplib_response = conn.getresponse(buffering=True)
2019-03-13 18:51:34 ERROR server odoo.addons.website.tests.test_crawl:474 write ` TypeError: getresponse() got an unexpected keyword argument 'buffering'
2019-03-13 18:51:34 ERROR server odoo.addons.website.tests.test_crawl:474 write `
2019-03-13 18:51:34 ERROR server odoo.addons.website.tests.test_crawl:474 write ` During handling of the above exception, another exception occurred:
2019-03-13 18:51:34 ERROR server odoo.addons.website.tests.test_crawl:474 write `
2019-03-13 18:51:34 ERROR server odoo.addons.website.tests.test_crawl:474 write ` Traceback (most recent call last):
2019-03-13 18:51:34 ERROR server odoo.addons.website.tests.test_crawl:474 write ` File "/usr/lib/python3/dist-packages/urllib3/connectionpool.py", line 379, in _make_request
2019-03-13 18:51:34 ERROR server odoo.addons.website.tests.test_crawl:474 write ` httplib_response = conn.getresponse()
2019-03-13 18:51:34 ERROR server odoo.addons.website.tests.test_crawl:474 write ` File "/usr/lib/python3.5/http/client.py", line 1197, in getresponse
2019-03-13 18:51:34 ERROR server odoo.addons.website.tests.test_crawl:474 write ` response.begin()
2019-03-13 18:51:34 ERROR server odoo.addons.website.tests.test_crawl:474 write ` File "/usr/lib/python3.5/http/client.py", line 297, in begin
2019-03-13 18:51:34 ERROR server odoo.addons.website.tests.test_crawl:474 write ` version, status, reason = self._read_status()
2019-03-13 18:51:34 ERROR server odoo.addons.website.tests.test_crawl:474 write ` File "/usr/lib/python3.5/http/client.py", line 258, in _read_status
2019-03-13 18:51:34 ERROR server odoo.addons.website.tests.test_crawl:474 write ` line = str(self.fp.readline(_MAXLINE + 1), "iso-8859-1")
2019-03-13 18:51:34 ERROR server odoo.addons.website.tests.test_crawl:474 write ` File "/usr/lib/python3.5/socket.py", line 575, in readinto
2019-03-13 18:51:34 ERROR server odoo.addons.website.tests.test_crawl:474 write ` return self._sock.recv_into(b)
2019-03-13 18:51:34 ERROR server odoo.addons.website.tests.test_crawl:474 write ` socket.timeout: timed out
2019-03-13 18:51:34 ERROR server odoo.addons.website.tests.test_crawl:474 write `
2019-03-13 18:51:34 ERROR server odoo.addons.website.tests.test_crawl:474 write ` During handling of the above exception, another exception occurred:
2019-03-13 18:51:34 ERROR server odoo.addons.website.tests.test_crawl:474 write `
2019-03-13 18:51:34 ERROR server odoo.addons.website.tests.test_crawl:474 write ` Traceback (most recent call last):
2019-03-13 18:51:34 ERROR server odoo.addons.website.tests.test_crawl:474 write ` File "/usr/lib/python3/dist-packages/requests/adapters.py", line 376, in send
2019-03-13 18:51:34 ERROR server odoo.addons.website.tests.test_crawl:474 write ` timeout=timeout
2019-03-13 18:51:34 ERROR server odoo.addons.website.tests.test_crawl:474 write ` File "/usr/lib/python3/dist-packages/urllib3/connectionpool.py", line 610, in urlopen
2019-03-13 18:51:34 ERROR server odoo.addons.website.tests.test_crawl:474 write ` _stacktrace=sys.exc_info()[2])
2019-03-13 18:51:34 ERROR server odoo.addons.website.tests.test_crawl:474 write ` File "/usr/lib/python3/dist-packages/urllib3/util/retry.py", line 247, in increment
2019-03-13 18:51:34 ERROR server odoo.addons.website.tests.test_crawl:474 write ` raise six.reraise(type(error), error, _stacktrace)
2019-03-13 18:51:34 ERROR server odoo.addons.website.tests.test_crawl:474 write ` File "/usr/lib/python3/dist-packages/six.py", line 686, in reraise
2019-03-13 18:51:34 ERROR server odoo.addons.website.tests.test_crawl:474 write ` raise value
2019-03-13 18:51:34 ERROR server odoo.addons.website.tests.test_crawl:474 write ` File "/usr/lib/python3/dist-packages/urllib3/connectionpool.py", line 560, in urlopen
2019-03-13 18:51:34 ERROR server odoo.addons.website.tests.test_crawl:474 write ` body=body, headers=headers)
2019-03-13 18:51:34 ERROR server odoo.addons.website.tests.test_crawl:474 write ` File "/usr/lib/python3/dist-packages/urllib3/connectionpool.py", line 381, in _make_request
2019-03-13 18:51:34 ERROR server odoo.addons.website.tests.test_crawl:474 write ` self._raise_timeout(err=e, url=url, timeout_value=read_timeout)
2019-03-13 18:51:34 ERROR server odoo.addons.website.tests.test_crawl:474 write ` File "/usr/lib/python3/dist-packages/urllib3/connectionpool.py", line 309, in _raise_timeout
2019-03-13 18:51:34 ERROR server odoo.addons.website.tests.test_crawl:474 write ` raise ReadTimeoutError(self, url, "Read timed out. (read timeout=%s)" % timeout_value)
2019-03-13 18:51:34 ERROR server odoo.addons.website.tests.test_crawl:474 write ` requests.packages.urllib3.exceptions.ReadTimeoutError: HTTPConnectionPool(host='127.0.0.1', port=2032): Read timed out. (read timeout=10)
2019-03-13 18:51:34 ERROR server odoo.addons.website.tests.test_crawl:474 write `
2019-03-13 18:51:34 ERROR server odoo.addons.website.tests.test_crawl:474 write ` During handling of the above exception, another exception occurred:
2019-03-13 18:51:34 ERROR server odoo.addons.website.tests.test_crawl:474 write `
2019-03-13 18:51:34 ERROR server odoo.addons.website.tests.test_crawl:474 write ` Traceback (most recent call last):
2019-03-13 18:51:34 ERROR server odoo.addons.website.tests.test_crawl:474 write ` File "/opt/odoo/odoo11/addons/website/tests/test_crawl.py", line 89, in test_30_crawl_admin
2019-03-13 18:51:34 ERROR server odoo.addons.website.tests.test_crawl:474 write ` seen = self.crawl('/', msg='admin')
2019-03-13 18:51:34 ERROR server odoo.addons.website.tests.test_crawl:474 write ` File "/opt/odoo/odoo11/addons/website/tests/test_crawl.py", line 41, in crawl
2019-03-13 18:51:34 ERROR server odoo.addons.website.tests.test_crawl:474 write ` r = self.url_open(url)
2019-03-13 18:51:34 ERROR server odoo.addons.website.tests.test_crawl:474 write ` File "/opt/odoo/odoo11/odoo/tests/common.py", line 281, in url_open
2019-03-13 18:51:34 ERROR server odoo.addons.website.tests.test_crawl:474 write ` return self.opener.get(url, timeout=timeout)
2019-03-13 18:51:34 ERROR server odoo.addons.website.tests.test_crawl:474 write ` File "/usr/lib/python3/dist-packages/requests/sessions.py", line 492, in get
2019-03-13 18:51:34 ERROR server odoo.addons.website.tests.test_crawl:474 write ` return self.request('GET', url, **kwargs)
2019-03-13 18:51:34 ERROR server odoo.addons.website.tests.test_crawl:474 write ` File "/usr/lib/python3/dist-packages/requests/sessions.py", line 480, in request
2019-03-13 18:51:34 ERROR server odoo.addons.website.tests.test_crawl:474 write ` resp = self.send(prep, **send_kwargs)
2019-03-13 18:51:34 ERROR server odoo.addons.website.tests.test_crawl:474 write ` File "/usr/lib/python3/dist-packages/requests/sessions.py", line 588, in send
2019-03-13 18:51:34 ERROR server odoo.addons.website.tests.test_crawl:474 write ` r = adapter.send(request, **kwargs)
2019-03-13 18:51:34 ERROR server odoo.addons.website.tests.test_crawl:474 write ` File "/usr/lib/python3/dist-packages/requests/adapters.py", line 449, in send
2019-03-13 18:51:34 ERROR server odoo.addons.website.tests.test_crawl:474 write ` raise ReadTimeout(e, request=request)
2019-03-13 18:51:34 ERROR server odoo.addons.website.tests.test_crawl:474 write ` requests.exceptions.ReadTimeout: HTTPConnectionPool(host='127.0.0.1', port=2032): Read timed out. (read timeout=10)
2019-03-13 18:51:34 ERROR server odoo.addons.website.tests.test_crawl:474 write FAILED
2019-03-13 18:51:34 INFO server odoo.modules.module:515 run_unit_tests odoo.addons.website.tests.test_crawl tested in 32.41s, 2176 queries
2019-03-13 18:51:34 ERROR server odoo.modules.module:518 run_unit_tests Module website: 0 failures, 3 errors
2019-03-13 18:51:48 INFO runbot run Start running build 09160-11-18-841b4b
2019-03-13 18:51:53 INFO server odoo.modules.loading:234 load_module_graph 1 modules loaded in 1.16s, 0 queries
2019-03-13 18:51:57 INFO server odoo.modules.loading:234 load_module_graph 173 modules loaded in 3.49s, 0 queries
2019-03-14 11:39:49 INFO runbot _ask_kill Killing build 09160-11-18-841b4b, requested by Administrator (user #1)
2019-03-14 11:39:58 INFO runbot kill Kill build 09160-11-18-841b4b