Subject: Merge branch '11.0-issue-1343' into '11.0'
Author: Intissar Boussetta
Committer: Intissar Boussetta

Date Level Type Message
2019-03-13 17:59:20 INFO runbot init Init build environment
2019-03-13 17:59:36 INFO runbot test_all Start test all modules
2019-03-13 18:01:10 INFO server odoo.modules.module:515 run_unit_tests odoo.addons.base.tests.test_base tested in 7.03s, 2711 queries
2019-03-13 18:01:18 INFO server odoo.modules.module:515 run_unit_tests odoo.addons.base.tests.test_expression tested in 8.01s, 5601 queries
2019-03-13 18:01:29 INFO server odoo.modules.module:515 run_unit_tests odoo.addons.base.tests.test_ir_actions tested in 9.91s, 2330 queries
2019-03-13 18:01:40 INFO server odoo.modules.module:515 run_unit_tests odoo.addons.base.tests.test_orm tested in 6.31s, 1993 queries
2019-03-13 18:02:18 INFO server odoo.modules.module:515 run_unit_tests odoo.addons.base.tests.test_translate tested in 32.09s, 25627 queries
2019-03-13 18:02:35 INFO server odoo.modules.module:515 run_unit_tests odoo.addons.base.tests.test_views tested in 15.37s, 4807 queries
2019-03-13 18:02:35 INFO server odoo.modules.loading:234 load_module_graph 1 modules loaded in 174.27s, 48227 queries
2019-03-13 18:03:01 INFO server odoo.modules.module:515 run_unit_tests odoo.addons.resource.tests.test_resource tested in 7.88s, 1982 queries
2019-03-13 18:03:47 INFO server odoo.modules.module:515 run_unit_tests odoo.addons.base_import.tests.test_base_import tested in 32.62s, 232 queries
2019-03-13 18:05:12 INFO server odoo.modules.module:515 run_unit_tests odoo.addons.mail.tests.test_mail_channel tested in 5.10s, 1600 queries
2019-03-13 18:05:26 INFO server odoo.modules.module:515 run_unit_tests odoo.addons.mail.tests.test_mail_features tested in 14.39s, 4125 queries
2019-03-13 18:05:46 INFO server odoo.modules.module:515 run_unit_tests odoo.addons.mail.tests.test_mail_gateway tested in 14.73s, 4915 queries
2019-03-13 18:05:57 INFO server odoo.modules.module:515 run_unit_tests odoo.addons.mail.tests.test_mail_message tested in 11.37s, 3566 queries
2019-03-13 18:06:04 INFO server odoo.modules.module:515 run_unit_tests odoo.addons.mail.tests.test_mail_template tested in 7.08s, 2088 queries
2019-03-13 18:07:05 INFO server odoo.modules.module:515 run_unit_tests odoo.addons.calendar.tests.test_calendar tested in 19.81s, 5842 queries
2019-03-13 18:07:40 INFO server odoo.modules.module:515 run_unit_tests odoo.addons.event.tests.test_event_flow tested in 15.70s, 4300 queries
2019-03-13 18:07:46 INFO server odoo.modules.module:515 run_unit_tests odoo.addons.event.tests.test_mail_schedule tested in 5.73s, 1412 queries
2019-03-13 18:10:30 INFO server odoo.modules.module:515 run_unit_tests odoo.addons.product.tests.test_product_pricelist tested in 14.20s, 622 queries
2019-03-13 18:10:52 INFO server odoo.modules.module:515 run_unit_tests odoo.addons.product.tests.test_variants tested in 22.05s, 7979 queries
2019-03-13 18:13:57 INFO server odoo.modules.module:515 run_unit_tests odoo.addons.crm.tests.test_crm_activity tested in 10.70s, 2562 queries
2019-03-13 18:14:25 INFO server odoo.modules.module:515 run_unit_tests odoo.addons.crm.tests.test_crm_lead tested in 27.37s, 6726 queries
2019-03-13 18:14:50 INFO server odoo.modules.module:515 run_unit_tests odoo.addons.crm.tests.test_lead2opportunity tested in 25.46s, 6739 queries
2019-03-13 18:16:17 INFO server odoo.modules.module:515 run_unit_tests odoo.addons.hr_holidays.tests.test_holidays_flow tested in 35.14s, 5544 queries
2019-03-13 18:18:40 INFO server odoo.modules.module:515 run_unit_tests odoo.addons.project.tests.test_access_rights tested in 21.83s, 5165 queries
2019-03-13 18:18:52 INFO server odoo.modules.module:515 run_unit_tests odoo.addons.project.tests.test_portal tested in 12.68s, 3180 queries
2019-03-13 18:19:07 INFO server odoo.modules.module:515 run_unit_tests odoo.addons.project.tests.test_project_flow tested in 14.79s, 3568 queries
2019-03-13 18:23:10 INFO server odoo.modules.module:515 run_unit_tests odoo.addons.hr_payroll.tests.test_payslip_flow tested in 20.63s, 1120 queries
2019-03-13 18:24:48 INFO server odoo.modules.module:515 run_unit_tests odoo.addons.survey.tests.test_survey tested in 44.84s, 11746 queries
2019-03-13 18:26:15 INFO server odoo.modules.module:515 run_unit_tests odoo.addons.hr_overtime.tests.test_overtime_flow tested in 5.96s, 1173 queries
2019-03-13 18:26:37 INFO server odoo.modules.module:515 run_unit_tests odoo.addons.hr_residence.tests.test_residence_flow tested in 5.10s, 1101 queries
2019-03-13 18:26:50 INFO server odoo.modules.module:515 run_unit_tests odoo.addons.hr_resignation.tests.test_resignation_flow tested in 6.51s, 1131 queries
2019-03-13 18:27:56 INFO server odoo.modules.module:515 run_unit_tests odoo.addons.purchase_request.tests.test_purchase_flow tested in 32.17s, 3386 queries
2019-03-13 18:29:20 INFO server odoo.modules.module:515 run_unit_tests odoo.addons.website_forum.tests.test_forum tested in 18.05s, 4667 queries
2019-03-13 18:31:20 INFO server odoo.modules.module:515 run_unit_tests odoo.addons.hr_attendance_extend.tests.test_attendnace_summary tested in 10.89s, 2989 queries
2019-03-13 18:31:40 INFO server odoo.modules.module:515 run_unit_tests odoo.addons.hr_attendance_extend.tests.test_authorization_flow tested in 19.61s, 1302 queries
2019-03-13 18:32:57 INFO server odoo.modules.module:515 run_unit_tests odoo.addons.hr_deputation.tests.test_deputation_flow tested in 35.14s, 4024 queries
2019-03-13 18:34:26 INFO server odoo.modules.module:515 run_unit_tests odoo.addons.hr_holidays_extend.tests.test_holidays_flow tested in 46.04s, 6961 queries
2019-03-13 18:34:43 INFO server odoo.modules.module:515 run_unit_tests odoo.addons.hr_recruitment_extend.tests.test_job_request_flow tested in 6.42s, 1163 queries
2019-03-13 18:35:37 INFO server odoo.modules.module:515 run_unit_tests odoo.addons.hr_training.tests.test_application_constrains tested in 7.85s, 1637 queries
2019-03-13 18:35:45 INFO server odoo.modules.module:515 run_unit_tests odoo.addons.hr_training.tests.test_application_flow tested in 8.18s, 2071 queries
2019-03-13 18:35:51 ERROR server odoo.addons.hr_training.tests.test_training_constrains:474 write ERROR
2019-03-13 18:35:51 ERROR server odoo.addons.hr_training.tests.test_training_constrains:474 write ERROR: test_training_constrains (odoo.addons.hr_training.tests.test_training_constrains.TestTrainingConstrains)
2019-03-13 18:35:51 ERROR server odoo.addons.hr_training.tests.test_training_constrains:474 write ` Test Training constraint.
2019-03-13 18:35:51 ERROR server odoo.addons.hr_training.tests.test_training_constrains:474 write Traceback (most recent call last):
2019-03-13 18:35:51 ERROR server odoo.addons.hr_training.tests.test_training_constrains:474 write ` File "/mnt/vdb/odoo/addons_runbot/runbot/static/build/09159-1267-34c92f/addons/hr_training/tests/test_training_constrains.py", line 76, in test_training_constrains
2019-03-13 18:35:51 ERROR server odoo.addons.hr_training.tests.test_training_constrains:474 write ` 'published': True})
2019-03-13 18:35:51 ERROR server odoo.addons.hr_training.tests.test_training_constrains:474 write ` File "/mnt/vdb/odoo/addons_runbot/runbot/static/build/09159-1267-34c92f/addons/hr_training/models/hr_training.py", line 50, in create
2019-03-13 18:35:51 ERROR server odoo.addons.hr_training.tests.test_training_constrains:474 write ` return super(HrTraining, self).create(vals)
2019-03-13 18:35:51 ERROR server odoo.addons.hr_training.tests.test_training_constrains:474 write ` File "/opt/odoo/odoo11/addons/mail/models/mail_thread.py", line 236, in create
2019-03-13 18:35:51 ERROR server odoo.addons.hr_training.tests.test_training_constrains:474 write ` thread = super(MailThread, self).create(values)
2019-03-13 18:35:51 ERROR server odoo.addons.hr_training.tests.test_training_constrains:474 write ` File "/mnt/vdb/odoo/addons_runbot/runbot/static/build/09159-1267-34c92f/addons/popup_reminder/models/popup_reminder.py", line 32, in create
2019-03-13 18:35:51 ERROR server odoo.addons.hr_training.tests.test_training_constrains:474 write ` record_id = create_original(self, vals)
2019-03-13 18:35:51 ERROR server odoo.addons.hr_training.tests.test_training_constrains:474 write ` File "/opt/odoo/odoo11/odoo/models.py", line 3372, in create
2019-03-13 18:35:51 ERROR server odoo.addons.hr_training.tests.test_training_constrains:474 write ` record = self.browse(self._create(old_vals))
2019-03-13 18:35:51 ERROR server odoo.addons.hr_training.tests.test_training_constrains:474 write ` File "/opt/odoo/odoo11/odoo/models.py", line 3525, in _create
2019-03-13 18:35:51 ERROR server odoo.addons.hr_training.tests.test_training_constrains:474 write ` self._validate_fields(vals)
2019-03-13 18:35:51 ERROR server odoo.addons.hr_training.tests.test_training_constrains:474 write ` File "/opt/odoo/odoo11/odoo/models.py", line 1036, in _validate_fields
2019-03-13 18:35:51 ERROR server odoo.addons.hr_training.tests.test_training_constrains:474 write ` check(self)
2019-03-13 18:35:51 ERROR server odoo.addons.hr_training.tests.test_training_constrains:474 write ` File "/mnt/vdb/odoo/addons_runbot/runbot/static/build/09159-1267-34c92f/addons/hr_training/models/hr_training.py", line 80, in _check_order_chek_date
2019-03-13 18:35:51 ERROR server odoo.addons.hr_training.tests.test_training_constrains:474 write ` raise ValidationError(_(" تاريخ التدريب يجب أن يكون أكبر من تاريخ اليوم"))
2019-03-13 18:35:51 ERROR server odoo.addons.hr_training.tests.test_training_constrains:474 write ` odoo.exceptions.ValidationError: (' تاريخ التدريب يجب أن يكون أكبر من تاريخ اليوم', None)
2019-03-13 18:35:51 ERROR server odoo.addons.hr_training.tests.test_training_constrains:474 write FAILED
2019-03-13 18:35:51 INFO server odoo.modules.module:515 run_unit_tests odoo.addons.hr_training.tests.test_training_constrains tested in 5.87s, 1311 queries
2019-03-13 18:35:51 ERROR server odoo.modules.module:518 run_unit_tests Module hr_training: 0 failures, 1 errors
2019-03-13 18:36:23 INFO server odoo.modules.module:515 run_unit_tests odoo.addons.hr_training.tests.test_training_flow tested in 32.28s, 4683 queries
2019-03-13 18:36:30 INFO server odoo.modules.module:515 run_unit_tests odoo.addons.hr_training.tests.test_training_public_flow tested in 6.99s, 1906 queries
2019-03-13 18:36:40 INFO server odoo.modules.module:515 run_unit_tests odoo.addons.hr_training.tests.test_training_request_constrains tested in 9.37s, 2148 queries
2019-03-13 18:36:50 INFO server odoo.modules.module:515 run_unit_tests odoo.addons.hr_training.tests.test_training_request_flow tested in 10.69s, 2766 queries
2019-03-13 18:37:47 INFO server odoo.modules.module:515 run_unit_tests odoo.addons.project_maintenance.tests.test_project_maintenance_flow tested in 33.18s, 6325 queries
2019-03-13 18:38:29 INFO server odoo.modules.module:515 run_unit_tests odoo.addons.crm_help.tests.test_crm_help_flow tested in 6.42s, 1310 queries
2019-03-13 18:38:54 INFO server odoo.modules.module:515 run_unit_tests odoo.addons.crm_visit.tests.test_crm_visit_flow tested in 6.29s, 1310 queries
2019-03-13 18:39:17 INFO server odoo.modules.module:515 run_unit_tests odoo.addons.hr_attendance_deputation.tests.test_attendnace_summary tested in 8.00s, 1722 queries
2019-03-13 18:39:33 INFO server odoo.modules.module:515 run_unit_tests odoo.addons.hr_attendance_training.tests.test_attendnace_summary tested in 9.06s, 2372 queries
2019-03-13 18:39:47 INFO server odoo.modules.module:515 run_unit_tests odoo.addons.hr_deputation_delegacy.tests.test_deputation_delegacy tested in 10.28s, 1765 queries
2019-03-13 18:40:03 INFO server odoo.modules.module:515 run_unit_tests odoo.addons.hr_deputation_training.tests.test_deputation_training_flow tested in 8.64s, 1580 queries
2019-03-13 18:40:11 INFO server odoo.modules.module:515 run_unit_tests odoo.addons.hr_deputation_training.tests.test_hr_deputation_training_constrains tested in 7.98s, 2014 queries
2019-03-13 18:40:24 INFO server odoo.modules.module:515 run_unit_tests odoo.addons.hr_holidays_attendance.tests.test_attendnace_summary tested in 8.16s, 1989 queries
2019-03-13 18:40:42 INFO server odoo.modules.module:515 run_unit_tests odoo.addons.hr_holidays_deputation.tests.test_deputation_holiday_flow tested in 6.17s, 1289 queries
2019-03-13 18:41:03 INFO server odoo.modules.module:515 run_unit_tests odoo.addons.hr_holidays_training.tests.test_hr_holidays_training_constrains tested in 8.34s, 2035 queries
2019-03-13 18:42:24 INFO server odoo.modules.module:515 run_unit_tests odoo.addons.hr_training_delegacy.tests.test_hr_training_delegacy_constrains tested in 6.82s, 1148 queries
2019-03-13 18:45:12 INFO server odoo.modules.loading:234 load_module_graph 169 modules loaded in 2547.29s, 171842 queries
2019-03-13 18:46:13 INFO server odoo.modules.loading:234 load_module_graph 173 modules loaded in 60.61s, 11 queries
2019-03-13 18:46:16 ERROR server odoo.modules.loading:471 load_modules At least one test failed when loading the modules.
2019-03-13 18:46:52 INFO server odoo.modules.module:515 run_unit_tests odoo.addons.base.tests.test_reports tested in 34.41s, 1055 queries
2019-03-13 18:46:59 INFO server odoo.modules.module:515 run_unit_tests odoo.addons.base_automation.tests.test_base_automation tested in 5.61s, 1813 queries
2019-03-13 18:47:08 INFO server odoo.modules.module:515 run_unit_tests odoo.addons.account.tests.test_account_customer_invoice tested in 8.02s, 2629 queries
2019-03-13 18:47:25 INFO server odoo.modules.module:515 run_unit_tests odoo.addons.account.tests.test_account_invoice_rounding tested in 17.43s, 4178 queries
2019-03-13 18:47:32 INFO server odoo.modules.module:515 run_unit_tests odoo.addons.account.tests.test_account_supplier_invoice tested in 6.61s, 1695 queries
2019-03-13 18:47:39 INFO server odoo.modules.module:515 run_unit_tests odoo.addons.account.tests.test_bank_statement_reconciliation tested in 6.51s, 1918 queries
2019-03-13 18:48:29 INFO server odoo.modules.module:515 run_unit_tests odoo.addons.account.tests.test_payment tested in 50.23s, 14518 queries
2019-03-13 18:50:42 INFO server odoo.modules.module:515 run_unit_tests odoo.addons.account.tests.test_reconciliation tested in 127.45s, 37487 queries
2019-03-13 18:50:49 INFO server odoo.modules.module:515 run_unit_tests odoo.addons.account.tests.test_search tested in 6.86s, 1634 queries
2019-03-13 18:51:12 INFO server odoo.modules.module:515 run_unit_tests odoo.addons.account.tests.test_tax tested in 21.73s, 5473 queries
2019-03-13 18:51:24 ERROR server odoo.addons.website.tests.test_crawl:474 write ERROR
2019-03-13 18:51:27 ERROR server odoo.addons.website.models.ir_http:206 _handle_exception
500 Internal Server Error:

Traceback (most recent call last):
  File "/opt/odoo/odoo11/odoo/tools/cache.py", line 84, in lookup
    r = d[key]
  File "/opt/odoo/odoo11/odoo/tools/func.py", line 68, in wrapper
    return func(self, *args, **kwargs)
  File "/opt/odoo/odoo11/odoo/tools/lru.py", line 44, in __getitem__
    a = self.d[obj].me
KeyError: ('ir.qweb', <function IrQWeb._get_asset_nodes at 0x7fe8a546d268>, 'web.assets_common', 'ar_SY', False, True, None, False, False, (1,))

During handling of the above exception, another exception occurred:

Traceback (most recent call last):
  File "/opt/odoo/odoo11/odoo/addons/base/ir/ir_qweb/qweb.py", line 343, in _compiled_fn
    return compiled(self, append, new, options, log)
  File "<template>", line 1, in template_web_login_layout_2281
  File "<template>", line 2, in body_call_content_2280
  File "<template>", line 4, in set_2278
  File "<decorator-gen-39>", line 2, in _get_asset_nodes
  File "/opt/odoo/odoo11/odoo/tools/cache.py", line 89, in lookup
    value = d[key] = self.method(*args, **kwargs)
  File "/opt/odoo/odoo11/odoo/addons/base/ir/ir_qweb/ir_qweb.py", line 302, in _get_asset_nodes
    return remains + asset.to_node(css=css, js=js, debug=debug, async_load=async_load)
  File "/opt/odoo/odoo11/odoo/addons/base/ir/ir_qweb/assetsbundle.py", line 168, in to_node
    ["src", self.js().url],
  File "/opt/odoo/odoo11/odoo/addons/base/ir/ir_qweb/assetsbundle.py", line 277, in js
    return self.save_attachment('js', content)
  File "/opt/odoo/odoo11/odoo/addons/base/ir/ir_qweb/assetsbundle.py", line 257, in save_attachment
    attachment = ira.sudo().create(values)
  File "/mnt/vdb/odoo/addons_runbot/runbot/static/build/09159-1267-34c92f/addons/dms/models/ir_attachment.py", line 20, in create
    number_ir_attachment = self.env['ir.sequence'].next_by_code('ir.attachment.seq')
  File "/opt/odoo/odoo11/odoo/addons/base/ir/ir_sequence.py", line 282, in next_by_code
    seq_ids = self.search([('code', '=', sequence_code), ('company_id', 'in', [force_company, False])], order='company_id')
  File "/opt/odoo/odoo11/odoo/models.py", line 1480, in search
    res = self._search(args, offset=offset, limit=limit, order=order, count=count)
  File "/opt/odoo/odoo11/odoo/models.py", line 3791, in _search
    self._cr.execute(query_str, where_clause_params)
  File "/opt/odoo/odoo11/odoo/sql_db.py", line 154, in wrapper
    raise psycopg2.OperationalError(msg)
psycopg2.OperationalError: Unable to use a closed cursor.

During handling of the above exception, another exception occurred:

Traceback (most recent call last):
  File "/opt/odoo/odoo11/odoo/tools/cache.py", line 84, in lookup
    r = d[key]
  File "/opt/odoo/odoo11/odoo/tools/func.py", line 68, in wrapper
    return func(self, *args, **kwargs)
  File "/opt/odoo/odoo11/odoo/tools/lru.py", line 44, in __getitem__
    a = self.d[obj].me
KeyError: ('ir.ui.view', <function View.get_view_id at 0x7fe89ec8d840>, 4, 'web.login_layout', (1,))

During handling of the above exception, another exception occurred:

Traceback (most recent call last):
  File "/opt/odoo/odoo11/odoo/tools/cache.py", line 84, in lookup
    r = d[key]
  File "/opt/odoo/odoo11/odoo/tools/func.py", line 68, in wrapper
    return func(self, *args, **kwargs)
  File "/opt/odoo/odoo11/odoo/tools/lru.py", line 44, in __getitem__
    a = self.d[obj].me
KeyError: ('ir.model.access', <function IrModelAccess.check at 0x7fe8a61c9d90>, 4, 'ir.ui.view', 'read', True, ('ar_SY',))

During handling of the above exception, another exception occurred:

Traceback (most recent call last):
  File "/opt/odoo/odoo11/odoo/addons/base/ir/ir_qweb/qweb.py", line 369, in get_template
    document = options.get('load', self.load)(template, options)
  File "/opt/odoo/odoo11/odoo/addons/base/ir/ir_qweb/ir_qweb.py", line 85, in load
    template = env['ir.ui.view'].read_template(name)
  File "/opt/odoo/odoo11/odoo/addons/base/ir/ir_ui_view.py", line 1103, in read_template
    return self._read_template(self.get_view_id(xml_id))
  File "<decorator-gen-160>", line 2, in get_view_id
  File "/opt/odoo/odoo11/odoo/tools/cache.py", line 89, in lookup
    value = d[key] = self.method(*args, **kwargs)
  File "/opt/odoo/odoo11/addons/website/models/ir_ui_view.py", line 87, in get_view_id
    view = self.search(domain, order='website_id', limit=1)
  File "/opt/odoo/odoo11/odoo/models.py", line 1480, in search
    res = self._search(args, offset=offset, limit=limit, order=order, count=count)
  File "/opt/odoo/odoo11/odoo/models.py", line 3767, in _search
    self.sudo(access_rights_uid or self._uid).check_access_rights('read')
  File "/opt/odoo/odoo11/odoo/models.py", line 2862, in check_access_rights
    return self.env['ir.model.access'].check(self._name, operation, raise_exception)
  File "<decorator-gen-20>", line 2, in check
  File "/opt/odoo/odoo11/odoo/tools/cache.py", line 89, in lookup
    value = d[key] = self.method(*args, **kwargs)
  File "/opt/odoo/odoo11/odoo/addons/base/ir/ir_model.py", line 1171, in check
    (model, self._uid,))
  File "/opt/odoo/odoo11/odoo/sql_db.py", line 154, in wrapper
    raise psycopg2.OperationalError(msg)
psycopg2.OperationalError: Unable to use a closed cursor.

During handling of the above exception, another exception occurred:

Traceback (most recent call last):
  File "/opt/odoo/odoo11/odoo/addons/base/ir/ir_http.py", line 208, in _dispatch
    result = request.dispatch()
  File "/opt/odoo/odoo11/odoo/http.py", line 829, in dispatch
    r = self._call_function(**self.params)
  File "/opt/odoo/odoo11/odoo/http.py", line 342, in _call_function
    return checked_call(self.db, *args, **kwargs)
  File "/opt/odoo/odoo11/odoo/service/model.py", line 97, in wrapper
    return f(dbname, *args, **kwargs)
  File "/opt/odoo/odoo11/odoo/http.py", line 338, in checked_call
    result.flatten()
  File "/opt/odoo/odoo11/odoo/http.py", line 1269, in flatten
    self.response.append(self.render())
  File "/opt/odoo/odoo11/odoo/http.py", line 1262, in render
    return env["ir.ui.view"].render_template(self.template, self.qcontext)
  File "/opt/odoo/odoo11/odoo/addons/base/ir/ir_ui_view.py", line 1208, in render_template
    return self.browse(self.get_view_id(template)).render(values, engine)
  File "/opt/odoo/odoo11/addons/website/models/ir_ui_view.py", line 113, in render
    return super(View, self).render(values, engine=engine)
  File "/opt/odoo/odoo11/addons/web_editor/models/ir_ui_view.py", line 27, in render
    return super(IrUiView, self).render(values=values, engine=engine)
  File "/opt/odoo/odoo11/odoo/addons/base/ir/ir_ui_view.py", line 1217, in render
    return self.env[engine].render(self.id, qcontext)
  File "/mnt/vdb/odoo/addons_runbot/runbot/static/build/09159-1267-34c92f/addons/odoo_rtl/models/ir_qweb.py", line 20, in render
    return super(IrQWeb, self).render(id_or_xml_id, values=values, **options)
  File "/opt/odoo/odoo11/odoo/addons/base/ir/ir_qweb/ir_qweb.py", line 57, in render
    return super(IrQWeb, self).render(id_or_xml_id, values=values, **context)
  File "/opt/odoo/odoo11/odoo/addons/base/ir/ir_qweb/qweb.py", line 272, in render
    self.compile(template, options)(self, body.append, values or {})
  File "/opt/odoo/odoo11/odoo/addons/base/ir/ir_qweb/qweb.py", line 345, in _compiled_fn
    raise e
  File "/opt/odoo/odoo11/odoo/addons/base/ir/ir_qweb/qweb.py", line 343, in _compiled_fn
    return compiled(self, append, new, options, log)
  File "<template>", line 1, in template_402_2275
  File "/opt/odoo/odoo11/odoo/addons/base/ir/ir_qweb/qweb.py", line 348, in _compiled_fn
    element, document = self.get_template(template, options)
  File "/opt/odoo/odoo11/odoo/addons/base/ir/ir_qweb/qweb.py", line 373, in get_template
    raise QWebException("load could not load template", name=template)
odoo.addons.base.ir.ir_qweb.qweb.QWebException: None
Traceback (most recent call last):
  File "/opt/odoo/odoo11/odoo/tools/cache.py", line 84, in lookup
    r = d[key]
  File "/opt/odoo/odoo11/odoo/tools/func.py", line 68, in wrapper
    return func(self, *args, **kwargs)
  File "/opt/odoo/odoo11/odoo/tools/lru.py", line 44, in __getitem__
    a = self.d[obj].me
KeyError: ('ir.qweb', <function IrQWeb._get_asset_nodes at 0x7fe8a546d268>, 'web.assets_common', 'ar_SY', False, True, None, False, False, (1,))

During handling of the above exception, another exception occurred:

Traceback (most recent call last):
  File "/opt/odoo/odoo11/odoo/addons/base/ir/ir_qweb/qweb.py", line 343, in _compiled_fn
    return compiled(self, append, new, options, log)
  File "<template>", line 1, in template_web_login_layout_2281
  File "<template>", line 2, in body_call_content_2280
  File "<template>", line 4, in set_2278
  File "<decorator-gen-39>", line 2, in _get_asset_nodes
  File "/opt/odoo/odoo11/odoo/tools/cache.py", line 89, in lookup
    value = d[key] = self.method(*args, **kwargs)
  File "/opt/odoo/odoo11/odoo/addons/base/ir/ir_qweb/ir_qweb.py", line 302, in _get_asset_nodes
    return remains + asset.to_node(css=css, js=js, debug=debug, async_load=async_load)
  File "/opt/odoo/odoo11/odoo/addons/base/ir/ir_qweb/assetsbundle.py", line 168, in to_node
    ["src", self.js().url],
  File "/opt/odoo/odoo11/odoo/addons/base/ir/ir_qweb/assetsbundle.py", line 277, in js
    return self.save_attachment('js', content)
  File "/opt/odoo/odoo11/odoo/addons/base/ir/ir_qweb/assetsbundle.py", line 257, in save_attachment
    attachment = ira.sudo().create(values)
  File "/mnt/vdb/odoo/addons_runbot/runbot/static/build/09159-1267-34c92f/addons/dms/models/ir_attachment.py", line 20, in create
    number_ir_attachment = self.env['ir.sequence'].next_by_code('ir.attachment.seq')
  File "/opt/odoo/odoo11/odoo/addons/base/ir/ir_sequence.py", line 282, in next_by_code
    seq_ids = self.search([('code', '=', sequence_code), ('company_id', 'in', [force_company, False])], order='company_id')
  File "/opt/odoo/odoo11/odoo/models.py", line 1480, in search
    res = self._search(args, offset=offset, limit=limit, order=order, count=count)
  File "/opt/odoo/odoo11/odoo/models.py", line 3791, in _search
    self._cr.execute(query_str, where_clause_params)
  File "/opt/odoo/odoo11/odoo/sql_db.py", line 154, in wrapper
    raise psycopg2.OperationalError(msg)
psycopg2.OperationalError: Unable to use a closed cursor.

During handling of the above exception, another exception occurred:

Traceback (most recent call last):
  File "/opt/odoo/odoo11/odoo/tools/cache.py", line 84, in lookup
    r = d[key]
  File "/opt/odoo/odoo11/odoo/tools/func.py", line 68, in wrapper
    return func(self, *args, **kwargs)
  File "/opt/odoo/odoo11/odoo/tools/lru.py", line 44, in __getitem__
    a = self.d[obj].me
KeyError: ('ir.ui.view', <function View.get_view_id at 0x7fe89ec8d840>, 4, 'web.login_layout', (1,))

During handling of the above exception, another exception occurred:

Traceback (most recent call last):
  File "/opt/odoo/odoo11/odoo/tools/cache.py", line 84, in lookup
    r = d[key]
  File "/opt/odoo/odoo11/odoo/tools/func.py", line 68, in wrapper
    return func(self, *args, **kwargs)
  File "/opt/odoo/odoo11/odoo/tools/lru.py", line 44, in __getitem__
    a = self.d[obj].me
KeyError: ('ir.model.access', <function IrModelAccess.check at 0x7fe8a61c9d90>, 4, 'ir.ui.view', 'read', True, ('ar_SY',))

During handling of the above exception, another exception occurred:

Traceback (most recent call last):
  File "/opt/odoo/odoo11/odoo/addons/base/ir/ir_qweb/qweb.py", line 369, in get_template
    document = options.get('load', self.load)(template, options)
  File "/opt/odoo/odoo11/odoo/addons/base/ir/ir_qweb/ir_qweb.py", line 85, in load
    template = env['ir.ui.view'].read_template(name)
  File "/opt/odoo/odoo11/odoo/addons/base/ir/ir_ui_view.py", line 1103, in read_template
    return self._read_template(self.get_view_id(xml_id))
  File "<decorator-gen-160>", line 2, in get_view_id
  File "/opt/odoo/odoo11/odoo/tools/cache.py", line 89, in lookup
    value = d[key] = self.method(*args, **kwargs)
  File "/opt/odoo/odoo11/addons/website/models/ir_ui_view.py", line 87, in get_view_id
    view = self.search(domain, order='website_id', limit=1)
  File "/opt/odoo/odoo11/odoo/models.py", line 1480, in search
    res = self._search(args, offset=offset, limit=limit, order=order, count=count)
  File "/opt/odoo/odoo11/odoo/models.py", line 3767, in _search
    self.sudo(access_rights_uid or self._uid).check_access_rights('read')
  File "/opt/odoo/odoo11/odoo/models.py", line 2862, in check_access_rights
    return self.env['ir.model.access'].check(self._name, operation, raise_exception)
  File "<decorator-gen-20>", line 2, in check
  File "/opt/odoo/odoo11/odoo/tools/cache.py", line 89, in lookup
    value = d[key] = self.method(*args, **kwargs)
  File "/opt/odoo/odoo11/odoo/addons/base/ir/ir_model.py", line 1171, in check
    (model, self._uid,))
  File "/opt/odoo/odoo11/odoo/sql_db.py", line 154, in wrapper
    raise psycopg2.OperationalError(msg)
psycopg2.OperationalError: Unable to use a closed cursor.

load could not load template
Template: web.login_layout
2019-03-13 18:51:29 ERROR server werkzeug:87 _log
Error on request:
Traceback (most recent call last):
  File "/usr/local/lib/python3.5/dist-packages/werkzeug/serving.py", line 209, in run_wsgi
    execute(self.server.app)
  File "/usr/local/lib/python3.5/dist-packages/werkzeug/serving.py", line 197, in execute
    application_iter = app(environ, start_response)
  File "/opt/odoo/odoo11/odoo/service/server.py", line 260, in app
    return self.app(e, s)
  File "/opt/odoo/odoo11/odoo/service/wsgi_server.py", line 166, in application
    return application_unproxied(environ, start_response)
  File "/opt/odoo/odoo11/odoo/service/wsgi_server.py", line 154, in application_unproxied
    result = handler(environ, start_response)
  File "/opt/odoo/odoo11/odoo/http.py", line 1318, in __call__
    return self.dispatch(environ, start_response)
  File "/opt/odoo/odoo11/odoo/http.py", line 1292, in __call__
    return self.app(environ, start_wrapped)
  File "/usr/local/lib/python3.5/dist-packages/werkzeug/wsgi.py", line 600, in __call__
    return self.app(environ, start_response)
  File "/opt/odoo/odoo11/odoo/http.py", line 1490, in dispatch
    result = ir_http._dispatch()
  File "/opt/odoo/odoo11/addons/auth_signup/models/ir_http.py", line 19, in _dispatch
    return super(Http, cls)._dispatch()
  File "/opt/odoo/odoo11/addons/web_editor/models/ir_http.py", line 22, in _dispatch
    return super(IrHttp, cls)._dispatch()
  File "/opt/odoo/odoo11/addons/http_routing/models/ir_http.py", line 393, in _dispatch
    result = super(IrHttp, cls)._dispatch()
  File "/opt/odoo/odoo11/addons/utm/models/ir_http.py", line 26, in _dispatch
    response = super(IrHttp, cls)._dispatch()
  File "/opt/odoo/odoo11/odoo/addons/base/ir/ir_http.py", line 212, in _dispatch
    return cls._handle_exception(e)
  File "/opt/odoo/odoo11/addons/website/models/ir_http.py", line 221, in _handle_exception
    if request.website.is_publisher() and isinstance(exception, werkzeug.exceptions.NotFound):
  File "/opt/odoo/odoo11/addons/website/models/website.py", line 400, in is_publisher
    return self.env['ir.model.access'].check('ir.ui.view', 'write', False)
  File "<decorator-gen-20>", line 2, in check
    
  File "/opt/odoo/odoo11/odoo/tools/cache.py", line 89, in lookup
    value = d[key] = self.method(*args, **kwargs)
  File "/opt/odoo/odoo11/odoo/addons/base/ir/ir_model.py", line 1171, in check
    (model, self._uid,))
  File "/opt/odoo/odoo11/odoo/sql_db.py", line 154, in wrapper
    raise psycopg2.OperationalError(msg)
psycopg2.OperationalError: Unable to use a closed cursor.
2019-03-13 18:51:35 ERROR server odoo.addons.website.models.ir_http:206 _handle_exception
500 Internal Server Error:

Traceback (most recent call last):
  File "/opt/odoo/odoo11/odoo/tools/cache.py", line 84, in lookup
    r = d[key]
  File "/opt/odoo/odoo11/odoo/tools/func.py", line 68, in wrapper
    return func(self, *args, **kwargs)
  File "/opt/odoo/odoo11/odoo/tools/lru.py", line 44, in __getitem__
    a = self.d[obj].me
KeyError: ('ir.qweb', <function IrQWeb._get_asset_nodes at 0x7fe8a546d268>, 'web.assets_common', 'ar_SY', True, False, None, False, False, (1,))

During handling of the above exception, another exception occurred:

Traceback (most recent call last):
  File "/opt/odoo/odoo11/odoo/addons/base/ir/ir_qweb/qweb.py", line 343, in _compiled_fn
    return compiled(self, append, new, options, log)
  File "<template>", line 1, in template_website_base_layout_2362
  File "<template>", line 2, in body_call_content_2361
  File "<template>", line 19, in set_2348
  File "<decorator-gen-39>", line 2, in _get_asset_nodes
  File "/opt/odoo/odoo11/odoo/tools/cache.py", line 89, in lookup
    value = d[key] = self.method(*args, **kwargs)
  File "/opt/odoo/odoo11/odoo/addons/base/ir/ir_qweb/ir_qweb.py", line 302, in _get_asset_nodes
    return remains + asset.to_node(css=css, js=js, debug=debug, async_load=async_load)
  File "/opt/odoo/odoo11/odoo/addons/base/ir/ir_qweb/assetsbundle.py", line 153, in to_node
    css_attachments = self.css() or []
  File "/opt/odoo/odoo11/odoo/addons/base/ir/ir_qweb/assetsbundle.py", line 310, in css
    self.save_attachment("css", ' '.join(page), inc=idx)
  File "/opt/odoo/odoo11/odoo/addons/base/ir/ir_qweb/assetsbundle.py", line 257, in save_attachment
    attachment = ira.sudo().create(values)
  File "/mnt/vdb/odoo/addons_runbot/runbot/static/build/09159-1267-34c92f/addons/dms/models/ir_attachment.py", line 22, in create
    return super(IrAttachment, self).create(vals)
  File "/opt/odoo/odoo11/odoo/addons/base/ir/ir_attachment.py", line 466, in create
    return super(IrAttachment, self).create(values)
  File "/mnt/vdb/odoo/addons_runbot/runbot/static/build/09159-1267-34c92f/addons/popup_reminder/models/popup_reminder.py", line 32, in create
    record_id = create_original(self, vals)
  File "/opt/odoo/odoo11/odoo/models.py", line 3372, in create
    record = self.browse(self._create(old_vals))
  File "/opt/odoo/odoo11/odoo/models.py", line 3468, in _create
    id_new, = cr.fetchone()
  File "/opt/odoo/odoo11/odoo/sql_db.py", line 154, in wrapper
    raise psycopg2.OperationalError(msg)
psycopg2.OperationalError: Unable to use a closed cursor.

During handling of the above exception, another exception occurred:

Traceback (most recent call last):
  File "/opt/odoo/odoo11/odoo/tools/cache.py", line 84, in lookup
    r = d[key]
  File "/opt/odoo/odoo11/odoo/tools/func.py", line 68, in wrapper
    return func(self, *args, **kwargs)
  File "/opt/odoo/odoo11/odoo/tools/lru.py", line 44, in __getitem__
    a = self.d[obj].me
KeyError: ('ir.ui.view', <function View.get_view_id at 0x7fe89ec8d840>, 5, 'website_base.layout', (1,))

During handling of the above exception, another exception occurred:

Traceback (most recent call last):
  File "/opt/odoo/odoo11/odoo/tools/cache.py", line 84, in lookup
    r = d[key]
  File "/opt/odoo/odoo11/odoo/tools/func.py", line 68, in wrapper
    return func(self, *args, **kwargs)
  File "/opt/odoo/odoo11/odoo/tools/lru.py", line 44, in __getitem__
    a = self.d[obj].me
KeyError: ('ir.model.access', <function IrModelAccess.check at 0x7fe8a61c9d90>, 5, 'ir.ui.view', 'read', True, ('ar_SY',))

During handling of the above exception, another exception occurred:

Traceback (most recent call last):
  File "/opt/odoo/odoo11/odoo/addons/base/ir/ir_qweb/qweb.py", line 369, in get_template
    document = options.get('load', self.load)(template, options)
  File "/opt/odoo/odoo11/odoo/addons/base/ir/ir_qweb/ir_qweb.py", line 85, in load
    template = env['ir.ui.view'].read_template(name)
  File "/opt/odoo/odoo11/odoo/addons/base/ir/ir_ui_view.py", line 1103, in read_template
    return self._read_template(self.get_view_id(xml_id))
  File "<decorator-gen-160>", line 2, in get_view_id
  File "/opt/odoo/odoo11/odoo/tools/cache.py", line 89, in lookup
    value = d[key] = self.method(*args, **kwargs)
  File "/opt/odoo/odoo11/addons/website/models/ir_ui_view.py", line 87, in get_view_id
    view = self.search(domain, order='website_id', limit=1)
  File "/opt/odoo/odoo11/odoo/models.py", line 1480, in search
    res = self._search(args, offset=offset, limit=limit, order=order, count=count)
  File "/opt/odoo/odoo11/odoo/models.py", line 3767, in _search
    self.sudo(access_rights_uid or self._uid).check_access_rights('read')
  File "/opt/odoo/odoo11/odoo/models.py", line 2862, in check_access_rights
    return self.env['ir.model.access'].check(self._name, operation, raise_exception)
  File "<decorator-gen-20>", line 2, in check
  File "/opt/odoo/odoo11/odoo/tools/cache.py", line 89, in lookup
    value = d[key] = self.method(*args, **kwargs)
  File "/opt/odoo/odoo11/odoo/addons/base/ir/ir_model.py", line 1171, in check
    (model, self._uid,))
  File "/opt/odoo/odoo11/odoo/sql_db.py", line 154, in wrapper
    raise psycopg2.OperationalError(msg)
psycopg2.OperationalError: Unable to use a closed cursor.

During handling of the above exception, another exception occurred:

Traceback (most recent call last):
  File "/opt/odoo/odoo11/odoo/addons/base/ir/ir_http.py", line 208, in _dispatch
    result = request.dispatch()
  File "/opt/odoo/odoo11/odoo/http.py", line 829, in dispatch
    r = self._call_function(**self.params)
  File "/opt/odoo/odoo11/odoo/http.py", line 342, in _call_function
    return checked_call(self.db, *args, **kwargs)
  File "/opt/odoo/odoo11/odoo/service/model.py", line 97, in wrapper
    return f(dbname, *args, **kwargs)
  File "/opt/odoo/odoo11/odoo/http.py", line 338, in checked_call
    result.flatten()
  File "/opt/odoo/odoo11/odoo/http.py", line 1269, in flatten
    self.response.append(self.render())
  File "/opt/odoo/odoo11/odoo/http.py", line 1262, in render
    return env["ir.ui.view"].render_template(self.template, self.qcontext)
  File "/opt/odoo/odoo11/odoo/addons/base/ir/ir_ui_view.py", line 1208, in render_template
    return self.browse(self.get_view_id(template)).render(values, engine)
  File "/opt/odoo/odoo11/addons/website/models/ir_ui_view.py", line 113, in render
    return super(View, self).render(values, engine=engine)
  File "/opt/odoo/odoo11/addons/web_editor/models/ir_ui_view.py", line 27, in render
    return super(IrUiView, self).render(values=values, engine=engine)
  File "/opt/odoo/odoo11/odoo/addons/base/ir/ir_ui_view.py", line 1217, in render
    return self.env[engine].render(self.id, qcontext)
  File "/mnt/vdb/odoo/addons_runbot/runbot/static/build/09159-1267-34c92f/addons/odoo_rtl/models/ir_qweb.py", line 20, in render
    return super(IrQWeb, self).render(id_or_xml_id, values=values, **options)
  File "/opt/odoo/odoo11/odoo/addons/base/ir/ir_qweb/ir_qweb.py", line 57, in render
    return super(IrQWeb, self).render(id_or_xml_id, values=values, **context)
  File "/opt/odoo/odoo11/odoo/addons/base/ir/ir_qweb/qweb.py", line 272, in render
    self.compile(template, options)(self, body.append, values or {})
  File "/opt/odoo/odoo11/odoo/addons/base/ir/ir_qweb/qweb.py", line 345, in _compiled_fn
    raise e
  File "/opt/odoo/odoo11/odoo/addons/base/ir/ir_qweb/qweb.py", line 343, in _compiled_fn
    return compiled(self, append, new, options, log)
  File "<template>", line 1, in template_1894_2336
  File "/opt/odoo/odoo11/odoo/addons/base/ir/ir_qweb/qweb.py", line 348, in _compiled_fn
    element, document = self.get_template(template, options)
  File "/opt/odoo/odoo11/odoo/addons/base/ir/ir_qweb/qweb.py", line 373, in get_template
    raise QWebException("load could not load template", name=template)
odoo.addons.base.ir.ir_qweb.qweb.QWebException: None
Traceback (most recent call last):
  File "/opt/odoo/odoo11/odoo/tools/cache.py", line 84, in lookup
    r = d[key]
  File "/opt/odoo/odoo11/odoo/tools/func.py", line 68, in wrapper
    return func(self, *args, **kwargs)
  File "/opt/odoo/odoo11/odoo/tools/lru.py", line 44, in __getitem__
    a = self.d[obj].me
KeyError: ('ir.qweb', <function IrQWeb._get_asset_nodes at 0x7fe8a546d268>, 'web.assets_common', 'ar_SY', True, False, None, False, False, (1,))

During handling of the above exception, another exception occurred:

Traceback (most recent call last):
  File "/opt/odoo/odoo11/odoo/addons/base/ir/ir_qweb/qweb.py", line 343, in _compiled_fn
    return compiled(self, append, new, options, log)
  File "<template>", line 1, in template_website_base_layout_2362
  File "<template>", line 2, in body_call_content_2361
  File "<template>", line 19, in set_2348
  File "<decorator-gen-39>", line 2, in _get_asset_nodes
  File "/opt/odoo/odoo11/odoo/tools/cache.py", line 89, in lookup
    value = d[key] = self.method(*args, **kwargs)
  File "/opt/odoo/odoo11/odoo/addons/base/ir/ir_qweb/ir_qweb.py", line 302, in _get_asset_nodes
    return remains + asset.to_node(css=css, js=js, debug=debug, async_load=async_load)
  File "/opt/odoo/odoo11/odoo/addons/base/ir/ir_qweb/assetsbundle.py", line 153, in to_node
    css_attachments = self.css() or []
  File "/opt/odoo/odoo11/odoo/addons/base/ir/ir_qweb/assetsbundle.py", line 310, in css
    self.save_attachment("css", ' '.join(page), inc=idx)
  File "/opt/odoo/odoo11/odoo/addons/base/ir/ir_qweb/assetsbundle.py", line 257, in save_attachment
    attachment = ira.sudo().create(values)
  File "/mnt/vdb/odoo/addons_runbot/runbot/static/build/09159-1267-34c92f/addons/dms/models/ir_attachment.py", line 22, in create
    return super(IrAttachment, self).create(vals)
  File "/opt/odoo/odoo11/odoo/addons/base/ir/ir_attachment.py", line 466, in create
    return super(IrAttachment, self).create(values)
  File "/mnt/vdb/odoo/addons_runbot/runbot/static/build/09159-1267-34c92f/addons/popup_reminder/models/popup_reminder.py", line 32, in create
    record_id = create_original(self, vals)
  File "/opt/odoo/odoo11/odoo/models.py", line 3372, in create
    record = self.browse(self._create(old_vals))
  File "/opt/odoo/odoo11/odoo/models.py", line 3468, in _create
    id_new, = cr.fetchone()
  File "/opt/odoo/odoo11/odoo/sql_db.py", line 154, in wrapper
    raise psycopg2.OperationalError(msg)
psycopg2.OperationalError: Unable to use a closed cursor.

During handling of the above exception, another exception occurred:

Traceback (most recent call last):
  File "/opt/odoo/odoo11/odoo/tools/cache.py", line 84, in lookup
    r = d[key]
  File "/opt/odoo/odoo11/odoo/tools/func.py", line 68, in wrapper
    return func(self, *args, **kwargs)
  File "/opt/odoo/odoo11/odoo/tools/lru.py", line 44, in __getitem__
    a = self.d[obj].me
KeyError: ('ir.ui.view', <function View.get_view_id at 0x7fe89ec8d840>, 5, 'website_base.layout', (1,))

During handling of the above exception, another exception occurred:

Traceback (most recent call last):
  File "/opt/odoo/odoo11/odoo/tools/cache.py", line 84, in lookup
    r = d[key]
  File "/opt/odoo/odoo11/odoo/tools/func.py", line 68, in wrapper
    return func(self, *args, **kwargs)
  File "/opt/odoo/odoo11/odoo/tools/lru.py", line 44, in __getitem__
    a = self.d[obj].me
KeyError: ('ir.model.access', <function IrModelAccess.check at 0x7fe8a61c9d90>, 5, 'ir.ui.view', 'read', True, ('ar_SY',))

During handling of the above exception, another exception occurred:

Traceback (most recent call last):
  File "/opt/odoo/odoo11/odoo/addons/base/ir/ir_qweb/qweb.py", line 369, in get_template
    document = options.get('load', self.load)(template, options)
  File "/opt/odoo/odoo11/odoo/addons/base/ir/ir_qweb/ir_qweb.py", line 85, in load
    template = env['ir.ui.view'].read_template(name)
  File "/opt/odoo/odoo11/odoo/addons/base/ir/ir_ui_view.py", line 1103, in read_template
    return self._read_template(self.get_view_id(xml_id))
  File "<decorator-gen-160>", line 2, in get_view_id
  File "/opt/odoo/odoo11/odoo/tools/cache.py", line 89, in lookup
    value = d[key] = self.method(*args, **kwargs)
  File "/opt/odoo/odoo11/addons/website/models/ir_ui_view.py", line 87, in get_view_id
    view = self.search(domain, order='website_id', limit=1)
  File "/opt/odoo/odoo11/odoo/models.py", line 1480, in search
    res = self._search(args, offset=offset, limit=limit, order=order, count=count)
  File "/opt/odoo/odoo11/odoo/models.py", line 3767, in _search
    self.sudo(access_rights_uid or self._uid).check_access_rights('read')
  File "/opt/odoo/odoo11/odoo/models.py", line 2862, in check_access_rights
    return self.env['ir.model.access'].check(self._name, operation, raise_exception)
  File "<decorator-gen-20>", line 2, in check
  File "/opt/odoo/odoo11/odoo/tools/cache.py", line 89, in lookup
    value = d[key] = self.method(*args, **kwargs)
  File "/opt/odoo/odoo11/odoo/addons/base/ir/ir_model.py", line 1171, in check
    (model, self._uid,))
  File "/opt/odoo/odoo11/odoo/sql_db.py", line 154, in wrapper
    raise psycopg2.OperationalError(msg)
psycopg2.OperationalError: Unable to use a closed cursor.

load could not load template
Template: website_base.layout
2019-03-13 18:51:35 ERROR server odoo.addons.website.tests.test_crawl:474 write ERROR
2019-03-13 18:51:35 ERROR server werkzeug:87 _log
Error on request:
Traceback (most recent call last):
  File "/usr/local/lib/python3.5/dist-packages/werkzeug/serving.py", line 209, in run_wsgi
    execute(self.server.app)
  File "/usr/local/lib/python3.5/dist-packages/werkzeug/serving.py", line 197, in execute
    application_iter = app(environ, start_response)
  File "/opt/odoo/odoo11/odoo/service/server.py", line 260, in app
    return self.app(e, s)
  File "/opt/odoo/odoo11/odoo/service/wsgi_server.py", line 166, in application
    return application_unproxied(environ, start_response)
  File "/opt/odoo/odoo11/odoo/service/wsgi_server.py", line 154, in application_unproxied
    result = handler(environ, start_response)
  File "/opt/odoo/odoo11/odoo/http.py", line 1318, in __call__
    return self.dispatch(environ, start_response)
  File "/opt/odoo/odoo11/odoo/http.py", line 1292, in __call__
    return self.app(environ, start_wrapped)
  File "/usr/local/lib/python3.5/dist-packages/werkzeug/wsgi.py", line 600, in __call__
    return self.app(environ, start_response)
  File "/opt/odoo/odoo11/odoo/http.py", line 1490, in dispatch
    result = ir_http._dispatch()
  File "/opt/odoo/odoo11/addons/auth_signup/models/ir_http.py", line 19, in _dispatch
    return super(Http, cls)._dispatch()
  File "/opt/odoo/odoo11/addons/web_editor/models/ir_http.py", line 22, in _dispatch
    return super(IrHttp, cls)._dispatch()
  File "/opt/odoo/odoo11/addons/http_routing/models/ir_http.py", line 393, in _dispatch
    result = super(IrHttp, cls)._dispatch()
  File "/opt/odoo/odoo11/addons/utm/models/ir_http.py", line 26, in _dispatch
    response = super(IrHttp, cls)._dispatch()
  File "/opt/odoo/odoo11/odoo/addons/base/ir/ir_http.py", line 212, in _dispatch
    return cls._handle_exception(e)
  File "/opt/odoo/odoo11/addons/website/models/ir_http.py", line 221, in _handle_exception
    if request.website.is_publisher() and isinstance(exception, werkzeug.exceptions.NotFound):
  File "/opt/odoo/odoo11/addons/website/models/website.py", line 400, in is_publisher
    return self.env['ir.model.access'].check('ir.ui.view', 'write', False)
  File "<decorator-gen-20>", line 2, in check
    
  File "/opt/odoo/odoo11/odoo/tools/cache.py", line 89, in lookup
    value = d[key] = self.method(*args, **kwargs)
  File "/opt/odoo/odoo11/odoo/addons/base/ir/ir_model.py", line 1171, in check
    (model, self._uid,))
  File "/opt/odoo/odoo11/odoo/sql_db.py", line 154, in wrapper
    raise psycopg2.OperationalError(msg)
psycopg2.OperationalError: Unable to use a closed cursor.
2019-03-13 18:51:46 ERROR server odoo.addons.website.tests.test_crawl:474 write ERROR
2019-03-13 18:51:46 ERROR server odoo.addons.website.tests.test_crawl:474 write ERROR: test_10_crawl_public (odoo.addons.website.tests.test_crawl.Crawler)
2019-03-13 18:51:46 ERROR server odoo.addons.website.tests.test_crawl:474 write Traceback (most recent call last):
2019-03-13 18:51:46 ERROR server odoo.addons.website.tests.test_crawl:474 write ` File "/usr/lib/python3/dist-packages/urllib3/connectionpool.py", line 377, in _make_request
2019-03-13 18:51:46 ERROR server odoo.addons.website.tests.test_crawl:474 write ` httplib_response = conn.getresponse(buffering=True)
2019-03-13 18:51:46 ERROR server odoo.addons.website.tests.test_crawl:474 write ` TypeError: getresponse() got an unexpected keyword argument 'buffering'
2019-03-13 18:51:46 ERROR server odoo.addons.website.tests.test_crawl:474 write `
2019-03-13 18:51:46 ERROR server odoo.addons.website.tests.test_crawl:474 write ` During handling of the above exception, another exception occurred:
2019-03-13 18:51:46 ERROR server odoo.addons.website.tests.test_crawl:474 write `
2019-03-13 18:51:46 ERROR server odoo.addons.website.tests.test_crawl:474 write ` Traceback (most recent call last):
2019-03-13 18:51:46 ERROR server odoo.addons.website.tests.test_crawl:474 write ` File "/usr/lib/python3/dist-packages/urllib3/connectionpool.py", line 379, in _make_request
2019-03-13 18:51:46 ERROR server odoo.addons.website.tests.test_crawl:474 write ` httplib_response = conn.getresponse()
2019-03-13 18:51:46 ERROR server odoo.addons.website.tests.test_crawl:474 write ` File "/usr/lib/python3.5/http/client.py", line 1197, in getresponse
2019-03-13 18:51:46 ERROR server odoo.addons.website.tests.test_crawl:474 write ` response.begin()
2019-03-13 18:51:46 ERROR server odoo.addons.website.tests.test_crawl:474 write ` File "/usr/lib/python3.5/http/client.py", line 297, in begin
2019-03-13 18:51:46 ERROR server odoo.addons.website.tests.test_crawl:474 write ` version, status, reason = self._read_status()
2019-03-13 18:51:46 ERROR server odoo.addons.website.tests.test_crawl:474 write ` File "/usr/lib/python3.5/http/client.py", line 258, in _read_status
2019-03-13 18:51:46 ERROR server odoo.addons.website.tests.test_crawl:474 write ` line = str(self.fp.readline(_MAXLINE + 1), "iso-8859-1")
2019-03-13 18:51:46 ERROR server odoo.addons.website.tests.test_crawl:474 write ` File "/usr/lib/python3.5/socket.py", line 575, in readinto
2019-03-13 18:51:46 ERROR server odoo.addons.website.tests.test_crawl:474 write ` return self._sock.recv_into(b)
2019-03-13 18:51:46 ERROR server odoo.addons.website.tests.test_crawl:474 write ` socket.timeout: timed out
2019-03-13 18:51:46 ERROR server odoo.addons.website.tests.test_crawl:474 write `
2019-03-13 18:51:46 ERROR server odoo.addons.website.tests.test_crawl:474 write ` During handling of the above exception, another exception occurred:
2019-03-13 18:51:46 ERROR server odoo.addons.website.tests.test_crawl:474 write `
2019-03-13 18:51:46 ERROR server odoo.addons.website.tests.test_crawl:474 write ` Traceback (most recent call last):
2019-03-13 18:51:46 ERROR server odoo.addons.website.tests.test_crawl:474 write ` File "/usr/lib/python3/dist-packages/requests/adapters.py", line 376, in send
2019-03-13 18:51:46 ERROR server odoo.addons.website.tests.test_crawl:474 write ` timeout=timeout
2019-03-13 18:51:46 ERROR server odoo.addons.website.tests.test_crawl:474 write ` File "/usr/lib/python3/dist-packages/urllib3/connectionpool.py", line 610, in urlopen
2019-03-13 18:51:46 ERROR server odoo.addons.website.tests.test_crawl:474 write ` _stacktrace=sys.exc_info()[2])
2019-03-13 18:51:46 ERROR server odoo.addons.website.tests.test_crawl:474 write ` File "/usr/lib/python3/dist-packages/urllib3/util/retry.py", line 247, in increment
2019-03-13 18:51:46 ERROR server odoo.addons.website.tests.test_crawl:474 write ` raise six.reraise(type(error), error, _stacktrace)
2019-03-13 18:51:46 ERROR server odoo.addons.website.tests.test_crawl:474 write ` File "/usr/lib/python3/dist-packages/six.py", line 686, in reraise
2019-03-13 18:51:46 ERROR server odoo.addons.website.tests.test_crawl:474 write ` raise value
2019-03-13 18:51:46 ERROR server odoo.addons.website.tests.test_crawl:474 write ` File "/usr/lib/python3/dist-packages/urllib3/connectionpool.py", line 560, in urlopen
2019-03-13 18:51:46 ERROR server odoo.addons.website.tests.test_crawl:474 write ` body=body, headers=headers)
2019-03-13 18:51:46 ERROR server odoo.addons.website.tests.test_crawl:474 write ` File "/usr/lib/python3/dist-packages/urllib3/connectionpool.py", line 381, in _make_request
2019-03-13 18:51:46 ERROR server odoo.addons.website.tests.test_crawl:474 write ` self._raise_timeout(err=e, url=url, timeout_value=read_timeout)
2019-03-13 18:51:46 ERROR server odoo.addons.website.tests.test_crawl:474 write ` File "/usr/lib/python3/dist-packages/urllib3/connectionpool.py", line 309, in _raise_timeout
2019-03-13 18:51:46 ERROR server odoo.addons.website.tests.test_crawl:474 write ` raise ReadTimeoutError(self, url, "Read timed out. (read timeout=%s)" % timeout_value)
2019-03-13 18:51:46 ERROR server odoo.addons.website.tests.test_crawl:474 write ` requests.packages.urllib3.exceptions.ReadTimeoutError: HTTPConnectionPool(host='127.0.0.1', port=2030): Read timed out. (read timeout=10)
2019-03-13 18:51:46 ERROR server odoo.addons.website.tests.test_crawl:474 write `
2019-03-13 18:51:46 ERROR server odoo.addons.website.tests.test_crawl:474 write ` During handling of the above exception, another exception occurred:
2019-03-13 18:51:46 ERROR server odoo.addons.website.tests.test_crawl:474 write `
2019-03-13 18:51:46 ERROR server odoo.addons.website.tests.test_crawl:474 write ` Traceback (most recent call last):
2019-03-13 18:51:46 ERROR server odoo.addons.website.tests.test_crawl:474 write ` File "/opt/odoo/odoo11/addons/website/tests/test_crawl.py", line 69, in test_10_crawl_public
2019-03-13 18:51:46 ERROR server odoo.addons.website.tests.test_crawl:474 write ` seen = self.crawl('/', msg='Anonymous Coward')
2019-03-13 18:51:46 ERROR server odoo.addons.website.tests.test_crawl:474 write ` File "/opt/odoo/odoo11/addons/website/tests/test_crawl.py", line 41, in crawl
2019-03-13 18:51:46 ERROR server odoo.addons.website.tests.test_crawl:474 write ` r = self.url_open(url)
2019-03-13 18:51:46 ERROR server odoo.addons.website.tests.test_crawl:474 write ` File "/opt/odoo/odoo11/odoo/tests/common.py", line 281, in url_open
2019-03-13 18:51:46 ERROR server odoo.addons.website.tests.test_crawl:474 write ` return self.opener.get(url, timeout=timeout)
2019-03-13 18:51:46 ERROR server odoo.addons.website.tests.test_crawl:474 write ` File "/usr/lib/python3/dist-packages/requests/sessions.py", line 492, in get
2019-03-13 18:51:46 ERROR server odoo.addons.website.tests.test_crawl:474 write ` return self.request('GET', url, **kwargs)
2019-03-13 18:51:46 ERROR server odoo.addons.website.tests.test_crawl:474 write ` File "/usr/lib/python3/dist-packages/requests/sessions.py", line 480, in request
2019-03-13 18:51:46 ERROR server odoo.addons.website.tests.test_crawl:474 write ` resp = self.send(prep, **send_kwargs)
2019-03-13 18:51:46 ERROR server odoo.addons.website.tests.test_crawl:474 write ` File "/usr/lib/python3/dist-packages/requests/sessions.py", line 609, in send
2019-03-13 18:51:46 ERROR server odoo.addons.website.tests.test_crawl:474 write ` history = [resp for resp in gen] if allow_redirects else []
2019-03-13 18:51:46 ERROR server odoo.addons.website.tests.test_crawl:474 write ` File "/usr/lib/python3/dist-packages/requests/sessions.py", line 609, in <listcomp>
2019-03-13 18:51:46 ERROR server odoo.addons.website.tests.test_crawl:474 write ` history = [resp for resp in gen] if allow_redirects else []
2019-03-13 18:51:46 ERROR server odoo.addons.website.tests.test_crawl:474 write ` File "/usr/lib/python3/dist-packages/requests/sessions.py", line 211, in resolve_redirects
2019-03-13 18:51:46 ERROR server odoo.addons.website.tests.test_crawl:474 write ` **adapter_kwargs
2019-03-13 18:51:46 ERROR server odoo.addons.website.tests.test_crawl:474 write ` File "/usr/lib/python3/dist-packages/requests/sessions.py", line 588, in send
2019-03-13 18:51:46 ERROR server odoo.addons.website.tests.test_crawl:474 write ` r = adapter.send(request, **kwargs)
2019-03-13 18:51:46 ERROR server odoo.addons.website.tests.test_crawl:474 write ` File "/usr/lib/python3/dist-packages/requests/adapters.py", line 449, in send
2019-03-13 18:51:46 ERROR server odoo.addons.website.tests.test_crawl:474 write ` raise ReadTimeout(e, request=request)
2019-03-13 18:51:46 ERROR server odoo.addons.website.tests.test_crawl:474 write ` requests.exceptions.ReadTimeout: HTTPConnectionPool(host='127.0.0.1', port=2030): Read timed out. (read timeout=10)
2019-03-13 18:51:46 ERROR server odoo.addons.website.tests.test_crawl:474 write ERROR: test_20_crawl_demo (odoo.addons.website.tests.test_crawl.Crawler)
2019-03-13 18:51:46 ERROR server odoo.addons.website.tests.test_crawl:474 write Traceback (most recent call last):
2019-03-13 18:51:46 ERROR server odoo.addons.website.tests.test_crawl:474 write ` File "/usr/lib/python3/dist-packages/urllib3/connectionpool.py", line 377, in _make_request
2019-03-13 18:51:46 ERROR server odoo.addons.website.tests.test_crawl:474 write ` httplib_response = conn.getresponse(buffering=True)
2019-03-13 18:51:46 ERROR server odoo.addons.website.tests.test_crawl:474 write ` TypeError: getresponse() got an unexpected keyword argument 'buffering'
2019-03-13 18:51:46 ERROR server odoo.addons.website.tests.test_crawl:474 write `
2019-03-13 18:51:46 ERROR server odoo.addons.website.tests.test_crawl:474 write ` During handling of the above exception, another exception occurred:
2019-03-13 18:51:46 ERROR server odoo.addons.website.tests.test_crawl:474 write `
2019-03-13 18:51:46 ERROR server odoo.addons.website.tests.test_crawl:474 write ` Traceback (most recent call last):
2019-03-13 18:51:46 ERROR server odoo.addons.website.tests.test_crawl:474 write ` File "/usr/lib/python3/dist-packages/urllib3/connectionpool.py", line 379, in _make_request
2019-03-13 18:51:46 ERROR server odoo.addons.website.tests.test_crawl:474 write ` httplib_response = conn.getresponse()
2019-03-13 18:51:46 ERROR server odoo.addons.website.tests.test_crawl:474 write ` File "/usr/lib/python3.5/http/client.py", line 1197, in getresponse
2019-03-13 18:51:46 ERROR server odoo.addons.website.tests.test_crawl:474 write ` response.begin()
2019-03-13 18:51:46 ERROR server odoo.addons.website.tests.test_crawl:474 write ` File "/usr/lib/python3.5/http/client.py", line 297, in begin
2019-03-13 18:51:46 ERROR server odoo.addons.website.tests.test_crawl:474 write ` version, status, reason = self._read_status()
2019-03-13 18:51:46 ERROR server odoo.addons.website.tests.test_crawl:474 write ` File "/usr/lib/python3.5/http/client.py", line 258, in _read_status
2019-03-13 18:51:46 ERROR server odoo.addons.website.tests.test_crawl:474 write ` line = str(self.fp.readline(_MAXLINE + 1), "iso-8859-1")
2019-03-13 18:51:46 ERROR server odoo.addons.website.tests.test_crawl:474 write ` File "/usr/lib/python3.5/socket.py", line 575, in readinto
2019-03-13 18:51:46 ERROR server odoo.addons.website.tests.test_crawl:474 write ` return self._sock.recv_into(b)
2019-03-13 18:51:46 ERROR server odoo.addons.website.tests.test_crawl:474 write ` socket.timeout: timed out
2019-03-13 18:51:46 ERROR server odoo.addons.website.tests.test_crawl:474 write `
2019-03-13 18:51:46 ERROR server odoo.addons.website.tests.test_crawl:474 write ` During handling of the above exception, another exception occurred:
2019-03-13 18:51:46 ERROR server odoo.addons.website.tests.test_crawl:474 write `
2019-03-13 18:51:46 ERROR server odoo.addons.website.tests.test_crawl:474 write ` Traceback (most recent call last):
2019-03-13 18:51:46 ERROR server odoo.addons.website.tests.test_crawl:474 write ` File "/usr/lib/python3/dist-packages/requests/adapters.py", line 376, in send
2019-03-13 18:51:46 ERROR server odoo.addons.website.tests.test_crawl:474 write ` timeout=timeout
2019-03-13 18:51:46 ERROR server odoo.addons.website.tests.test_crawl:474 write ` File "/usr/lib/python3/dist-packages/urllib3/connectionpool.py", line 610, in urlopen
2019-03-13 18:51:46 ERROR server odoo.addons.website.tests.test_crawl:474 write ` _stacktrace=sys.exc_info()[2])
2019-03-13 18:51:46 ERROR server odoo.addons.website.tests.test_crawl:474 write ` File "/usr/lib/python3/dist-packages/urllib3/util/retry.py", line 247, in increment
2019-03-13 18:51:46 ERROR server odoo.addons.website.tests.test_crawl:474 write ` raise six.reraise(type(error), error, _stacktrace)
2019-03-13 18:51:46 ERROR server odoo.addons.website.tests.test_crawl:474 write ` File "/usr/lib/python3/dist-packages/six.py", line 686, in reraise
2019-03-13 18:51:46 ERROR server odoo.addons.website.tests.test_crawl:474 write ` raise value
2019-03-13 18:51:46 ERROR server odoo.addons.website.tests.test_crawl:474 write ` File "/usr/lib/python3/dist-packages/urllib3/connectionpool.py", line 560, in urlopen
2019-03-13 18:51:46 ERROR server odoo.addons.website.tests.test_crawl:474 write ` body=body, headers=headers)
2019-03-13 18:51:46 ERROR server odoo.addons.website.tests.test_crawl:474 write ` File "/usr/lib/python3/dist-packages/urllib3/connectionpool.py", line 381, in _make_request
2019-03-13 18:51:46 ERROR server odoo.addons.website.tests.test_crawl:474 write ` self._raise_timeout(err=e, url=url, timeout_value=read_timeout)
2019-03-13 18:51:46 ERROR server odoo.addons.website.tests.test_crawl:474 write ` File "/usr/lib/python3/dist-packages/urllib3/connectionpool.py", line 309, in _raise_timeout
2019-03-13 18:51:46 ERROR server odoo.addons.website.tests.test_crawl:474 write ` raise ReadTimeoutError(self, url, "Read timed out. (read timeout=%s)" % timeout_value)
2019-03-13 18:51:46 ERROR server odoo.addons.website.tests.test_crawl:474 write ` requests.packages.urllib3.exceptions.ReadTimeoutError: HTTPConnectionPool(host='127.0.0.1', port=2030): Read timed out. (read timeout=10)
2019-03-13 18:51:46 ERROR server odoo.addons.website.tests.test_crawl:474 write `
2019-03-13 18:51:46 ERROR server odoo.addons.website.tests.test_crawl:474 write ` During handling of the above exception, another exception occurred:
2019-03-13 18:51:46 ERROR server odoo.addons.website.tests.test_crawl:474 write `
2019-03-13 18:51:46 ERROR server odoo.addons.website.tests.test_crawl:474 write ` Traceback (most recent call last):
2019-03-13 18:51:46 ERROR server odoo.addons.website.tests.test_crawl:474 write ` File "/opt/odoo/odoo11/addons/website/tests/test_crawl.py", line 79, in test_20_crawl_demo
2019-03-13 18:51:46 ERROR server odoo.addons.website.tests.test_crawl:474 write ` seen = self.crawl('/', msg='demo')
2019-03-13 18:51:46 ERROR server odoo.addons.website.tests.test_crawl:474 write ` File "/opt/odoo/odoo11/addons/website/tests/test_crawl.py", line 41, in crawl
2019-03-13 18:51:46 ERROR server odoo.addons.website.tests.test_crawl:474 write ` r = self.url_open(url)
2019-03-13 18:51:46 ERROR server odoo.addons.website.tests.test_crawl:474 write ` File "/opt/odoo/odoo11/odoo/tests/common.py", line 281, in url_open
2019-03-13 18:51:46 ERROR server odoo.addons.website.tests.test_crawl:474 write ` return self.opener.get(url, timeout=timeout)
2019-03-13 18:51:46 ERROR server odoo.addons.website.tests.test_crawl:474 write ` File "/usr/lib/python3/dist-packages/requests/sessions.py", line 492, in get
2019-03-13 18:51:46 ERROR server odoo.addons.website.tests.test_crawl:474 write ` return self.request('GET', url, **kwargs)
2019-03-13 18:51:46 ERROR server odoo.addons.website.tests.test_crawl:474 write ` File "/usr/lib/python3/dist-packages/requests/sessions.py", line 480, in request
2019-03-13 18:51:46 ERROR server odoo.addons.website.tests.test_crawl:474 write ` resp = self.send(prep, **send_kwargs)
2019-03-13 18:51:46 ERROR server odoo.addons.website.tests.test_crawl:474 write ` File "/usr/lib/python3/dist-packages/requests/sessions.py", line 588, in send
2019-03-13 18:51:46 ERROR server odoo.addons.website.tests.test_crawl:474 write ` r = adapter.send(request, **kwargs)
2019-03-13 18:51:46 ERROR server odoo.addons.website.tests.test_crawl:474 write ` File "/usr/lib/python3/dist-packages/requests/adapters.py", line 449, in send
2019-03-13 18:51:46 ERROR server odoo.addons.website.tests.test_crawl:474 write ` raise ReadTimeout(e, request=request)
2019-03-13 18:51:46 ERROR server odoo.addons.website.tests.test_crawl:474 write ` requests.exceptions.ReadTimeout: HTTPConnectionPool(host='127.0.0.1', port=2030): Read timed out. (read timeout=10)
2019-03-13 18:51:46 ERROR server odoo.addons.website.tests.test_crawl:474 write ERROR: test_30_crawl_admin (odoo.addons.website.tests.test_crawl.Crawler)
2019-03-13 18:51:46 ERROR server odoo.addons.website.tests.test_crawl:474 write Traceback (most recent call last):
2019-03-13 18:51:46 ERROR server odoo.addons.website.tests.test_crawl:474 write ` File "/usr/lib/python3/dist-packages/urllib3/connectionpool.py", line 377, in _make_request
2019-03-13 18:51:46 ERROR server odoo.addons.website.tests.test_crawl:474 write ` httplib_response = conn.getresponse(buffering=True)
2019-03-13 18:51:46 ERROR server odoo.addons.website.tests.test_crawl:474 write ` TypeError: getresponse() got an unexpected keyword argument 'buffering'
2019-03-13 18:51:46 ERROR server odoo.addons.website.tests.test_crawl:474 write `
2019-03-13 18:51:46 ERROR server odoo.addons.website.tests.test_crawl:474 write ` During handling of the above exception, another exception occurred:
2019-03-13 18:51:46 ERROR server odoo.addons.website.tests.test_crawl:474 write `
2019-03-13 18:51:46 ERROR server odoo.addons.website.tests.test_crawl:474 write ` Traceback (most recent call last):
2019-03-13 18:51:46 ERROR server odoo.addons.website.tests.test_crawl:474 write ` File "/usr/lib/python3/dist-packages/urllib3/connectionpool.py", line 379, in _make_request
2019-03-13 18:51:46 ERROR server odoo.addons.website.tests.test_crawl:474 write ` httplib_response = conn.getresponse()
2019-03-13 18:51:46 ERROR server odoo.addons.website.tests.test_crawl:474 write ` File "/usr/lib/python3.5/http/client.py", line 1197, in getresponse
2019-03-13 18:51:46 ERROR server odoo.addons.website.tests.test_crawl:474 write ` response.begin()
2019-03-13 18:51:46 ERROR server odoo.addons.website.tests.test_crawl:474 write ` File "/usr/lib/python3.5/http/client.py", line 297, in begin
2019-03-13 18:51:46 ERROR server odoo.addons.website.tests.test_crawl:474 write ` version, status, reason = self._read_status()
2019-03-13 18:51:46 ERROR server odoo.addons.website.tests.test_crawl:474 write ` File "/usr/lib/python3.5/http/client.py", line 258, in _read_status
2019-03-13 18:51:46 ERROR server odoo.addons.website.tests.test_crawl:474 write ` line = str(self.fp.readline(_MAXLINE + 1), "iso-8859-1")
2019-03-13 18:51:46 ERROR server odoo.addons.website.tests.test_crawl:474 write ` File "/usr/lib/python3.5/socket.py", line 575, in readinto
2019-03-13 18:51:46 ERROR server odoo.addons.website.tests.test_crawl:474 write ` return self._sock.recv_into(b)
2019-03-13 18:51:46 ERROR server odoo.addons.website.tests.test_crawl:474 write ` socket.timeout: timed out
2019-03-13 18:51:46 ERROR server odoo.addons.website.tests.test_crawl:474 write `
2019-03-13 18:51:46 ERROR server odoo.addons.website.tests.test_crawl:474 write ` During handling of the above exception, another exception occurred:
2019-03-13 18:51:46 ERROR server odoo.addons.website.tests.test_crawl:474 write `
2019-03-13 18:51:46 ERROR server odoo.addons.website.tests.test_crawl:474 write ` Traceback (most recent call last):
2019-03-13 18:51:46 ERROR server odoo.addons.website.tests.test_crawl:474 write ` File "/usr/lib/python3/dist-packages/requests/adapters.py", line 376, in send
2019-03-13 18:51:46 ERROR server odoo.addons.website.tests.test_crawl:474 write ` timeout=timeout
2019-03-13 18:51:46 ERROR server odoo.addons.website.tests.test_crawl:474 write ` File "/usr/lib/python3/dist-packages/urllib3/connectionpool.py", line 610, in urlopen
2019-03-13 18:51:46 ERROR server odoo.addons.website.tests.test_crawl:474 write ` _stacktrace=sys.exc_info()[2])
2019-03-13 18:51:46 ERROR server odoo.addons.website.tests.test_crawl:474 write ` File "/usr/lib/python3/dist-packages/urllib3/util/retry.py", line 247, in increment
2019-03-13 18:51:46 ERROR server odoo.addons.website.tests.test_crawl:474 write ` raise six.reraise(type(error), error, _stacktrace)
2019-03-13 18:51:46 ERROR server odoo.addons.website.tests.test_crawl:474 write ` File "/usr/lib/python3/dist-packages/six.py", line 686, in reraise
2019-03-13 18:51:46 ERROR server odoo.addons.website.tests.test_crawl:474 write ` raise value
2019-03-13 18:51:46 ERROR server odoo.addons.website.tests.test_crawl:474 write ` File "/usr/lib/python3/dist-packages/urllib3/connectionpool.py", line 560, in urlopen
2019-03-13 18:51:46 ERROR server odoo.addons.website.tests.test_crawl:474 write ` body=body, headers=headers)
2019-03-13 18:51:46 ERROR server odoo.addons.website.tests.test_crawl:474 write ` File "/usr/lib/python3/dist-packages/urllib3/connectionpool.py", line 381, in _make_request
2019-03-13 18:51:46 ERROR server odoo.addons.website.tests.test_crawl:474 write ` self._raise_timeout(err=e, url=url, timeout_value=read_timeout)
2019-03-13 18:51:46 ERROR server odoo.addons.website.tests.test_crawl:474 write ` File "/usr/lib/python3/dist-packages/urllib3/connectionpool.py", line 309, in _raise_timeout
2019-03-13 18:51:46 ERROR server odoo.addons.website.tests.test_crawl:474 write ` raise ReadTimeoutError(self, url, "Read timed out. (read timeout=%s)" % timeout_value)
2019-03-13 18:51:46 ERROR server odoo.addons.website.tests.test_crawl:474 write ` requests.packages.urllib3.exceptions.ReadTimeoutError: HTTPConnectionPool(host='127.0.0.1', port=2030): Read timed out. (read timeout=10)
2019-03-13 18:51:46 ERROR server odoo.addons.website.tests.test_crawl:474 write `
2019-03-13 18:51:46 ERROR server odoo.addons.website.tests.test_crawl:474 write ` During handling of the above exception, another exception occurred:
2019-03-13 18:51:46 ERROR server odoo.addons.website.tests.test_crawl:474 write `
2019-03-13 18:51:46 ERROR server odoo.addons.website.tests.test_crawl:474 write ` Traceback (most recent call last):
2019-03-13 18:51:46 ERROR server odoo.addons.website.tests.test_crawl:474 write ` File "/opt/odoo/odoo11/addons/website/tests/test_crawl.py", line 89, in test_30_crawl_admin
2019-03-13 18:51:46 ERROR server odoo.addons.website.tests.test_crawl:474 write ` seen = self.crawl('/', msg='admin')
2019-03-13 18:51:46 ERROR server odoo.addons.website.tests.test_crawl:474 write ` File "/opt/odoo/odoo11/addons/website/tests/test_crawl.py", line 41, in crawl
2019-03-13 18:51:46 ERROR server odoo.addons.website.tests.test_crawl:474 write ` r = self.url_open(url)
2019-03-13 18:51:46 ERROR server odoo.addons.website.tests.test_crawl:474 write ` File "/opt/odoo/odoo11/odoo/tests/common.py", line 281, in url_open
2019-03-13 18:51:46 ERROR server odoo.addons.website.tests.test_crawl:474 write ` return self.opener.get(url, timeout=timeout)
2019-03-13 18:51:46 ERROR server odoo.addons.website.tests.test_crawl:474 write ` File "/usr/lib/python3/dist-packages/requests/sessions.py", line 492, in get
2019-03-13 18:51:46 ERROR server odoo.addons.website.tests.test_crawl:474 write ` return self.request('GET', url, **kwargs)
2019-03-13 18:51:46 ERROR server odoo.addons.website.tests.test_crawl:474 write ` File "/usr/lib/python3/dist-packages/requests/sessions.py", line 480, in request
2019-03-13 18:51:46 ERROR server odoo.addons.website.tests.test_crawl:474 write ` resp = self.send(prep, **send_kwargs)
2019-03-13 18:51:46 ERROR server odoo.addons.website.tests.test_crawl:474 write ` File "/usr/lib/python3/dist-packages/requests/sessions.py", line 588, in send
2019-03-13 18:51:46 ERROR server odoo.addons.website.tests.test_crawl:474 write ` r = adapter.send(request, **kwargs)
2019-03-13 18:51:46 ERROR server odoo.addons.website.tests.test_crawl:474 write ` File "/usr/lib/python3/dist-packages/requests/adapters.py", line 449, in send
2019-03-13 18:51:46 ERROR server odoo.addons.website.tests.test_crawl:474 write ` raise ReadTimeout(e, request=request)
2019-03-13 18:51:46 ERROR server odoo.addons.website.tests.test_crawl:474 write ` requests.exceptions.ReadTimeout: HTTPConnectionPool(host='127.0.0.1', port=2030): Read timed out. (read timeout=10)
2019-03-13 18:51:46 ERROR server odoo.addons.website.tests.test_crawl:474 write FAILED
2019-03-13 18:51:46 INFO server odoo.modules.module:515 run_unit_tests odoo.addons.website.tests.test_crawl tested in 33.34s, 2216 queries
2019-03-13 18:51:46 ERROR server odoo.modules.module:518 run_unit_tests Module website: 0 failures, 3 errors
2019-03-13 18:52:11 INFO runbot run Start running build 09159-1267-34c92f
2019-03-13 18:52:14 INFO server odoo.modules.loading:234 load_module_graph 1 modules loaded in 1.01s, 0 queries
2019-03-13 18:52:18 INFO server odoo.modules.loading:234 load_module_graph 173 modules loaded in 4.33s, 0 queries
2019-03-14 11:39:35 INFO runbot _ask_kill Killing build 09159-1267-34c92f, requested by Administrator (user #1)
2019-03-14 11:39:44 INFO runbot kill Kill build 09159-1267-34c92f