Subject: [FIX]Remove some field from demo
Author: iboussetta
Committer: iboussetta

Date Level Type Message
2019-03-13 15:14:09 INFO runbot init Init build environment
2019-03-13 15:14:22 INFO runbot test_all Start test all modules
2019-03-13 15:15:20 INFO server odoo.modules.module:515 run_unit_tests odoo.addons.base.tests.test_translate tested in 8.24s, 25627 queries
2019-03-13 15:15:25 INFO server odoo.modules.loading:234 load_module_graph 1 modules loaded in 56.91s, 48255 queries
2019-03-13 15:15:47 INFO server odoo.modules.module:515 run_unit_tests odoo.addons.base_import.tests.test_base_import tested in 9.25s, 232 queries
2019-03-13 15:16:28 INFO server odoo.modules.module:515 run_unit_tests odoo.addons.mail.tests.test_mail_gateway tested in 5.52s, 4915 queries
2019-03-13 15:16:57 INFO server odoo.modules.module:515 run_unit_tests odoo.addons.calendar.tests.test_calendar tested in 7.50s, 5835 queries
2019-03-13 15:17:10 INFO server odoo.modules.module:515 run_unit_tests odoo.addons.event.tests.test_event_flow tested in 5.41s, 4300 queries
2019-03-13 15:18:15 INFO server odoo.modules.module:515 run_unit_tests odoo.addons.product.tests.test_variants tested in 8.20s, 7979 queries
2019-03-13 15:19:29 INFO server odoo.modules.module:515 run_unit_tests odoo.addons.crm.tests.test_crm_lead tested in 9.52s, 6724 queries
2019-03-13 15:19:38 INFO server odoo.modules.module:515 run_unit_tests odoo.addons.crm.tests.test_lead2opportunity tested in 9.38s, 6739 queries
2019-03-13 15:20:07 INFO server odoo.modules.module:515 run_unit_tests odoo.addons.hr_holidays.tests.test_holidays_flow tested in 11.20s, 5544 queries
2019-03-13 15:20:55 INFO server odoo.modules.module:515 run_unit_tests odoo.addons.project.tests.test_access_rights tested in 6.97s, 5163 queries
2019-03-13 15:22:25 INFO server odoo.modules.module:515 run_unit_tests odoo.addons.hr_payroll.tests.test_payslip_flow tested in 5.91s, 1120 queries
2019-03-13 15:22:59 INFO server odoo.modules.module:515 run_unit_tests odoo.addons.survey.tests.test_survey tested in 15.35s, 11746 queries
2019-03-13 15:24:01 INFO server odoo.modules.module:515 run_unit_tests odoo.addons.purchase_request.tests.test_purchase_flow tested in 10.54s, 3386 queries
2019-03-13 15:24:31 INFO server odoo.modules.module:515 run_unit_tests odoo.addons.website_forum.tests.test_forum tested in 6.21s, 4667 queries
2019-03-13 15:25:19 INFO server odoo.modules.module:515 run_unit_tests odoo.addons.hr_attendance_extend.tests.test_authorization_flow tested in 5.84s, 1302 queries
2019-03-13 15:25:46 INFO server odoo.modules.module:515 run_unit_tests odoo.addons.hr_deputation.tests.test_deputation_flow tested in 11.75s, 4024 queries
2019-03-13 15:26:17 INFO server odoo.modules.module:515 run_unit_tests odoo.addons.hr_holidays_extend.tests.test_holidays_flow tested in 15.05s, 6961 queries
2019-03-13 15:26:46 ERROR server odoo.addons.hr_training.tests.test_training_constrains:474 write ERROR
2019-03-13 15:26:46 ERROR server odoo.addons.hr_training.tests.test_training_constrains:474 write ERROR: test_training_constrains (odoo.addons.hr_training.tests.test_training_constrains.TestTrainingConstrains)
2019-03-13 15:26:46 ERROR server odoo.addons.hr_training.tests.test_training_constrains:474 write ` Test Training constraint.
2019-03-13 15:26:46 ERROR server odoo.addons.hr_training.tests.test_training_constrains:474 write Traceback (most recent call last):
2019-03-13 15:26:46 ERROR server odoo.addons.hr_training.tests.test_training_constrains:474 write ` File "/mnt/vdb/odoo/addons_runbot/runbot/static/build/09143-1244-538c35/addons/hr_training/tests/test_training_constrains.py", line 76, in test_training_constrains
2019-03-13 15:26:46 ERROR server odoo.addons.hr_training.tests.test_training_constrains:474 write ` 'published': True})
2019-03-13 15:26:46 ERROR server odoo.addons.hr_training.tests.test_training_constrains:474 write ` File "/mnt/vdb/odoo/addons_runbot/runbot/static/build/09143-1244-538c35/addons/hr_training/models/hr_training.py", line 50, in create
2019-03-13 15:26:46 ERROR server odoo.addons.hr_training.tests.test_training_constrains:474 write ` return super(HrTraining, self).create(vals)
2019-03-13 15:26:46 ERROR server odoo.addons.hr_training.tests.test_training_constrains:474 write ` File "/opt/odoo/odoo11/addons/mail/models/mail_thread.py", line 236, in create
2019-03-13 15:26:46 ERROR server odoo.addons.hr_training.tests.test_training_constrains:474 write ` thread = super(MailThread, self).create(values)
2019-03-13 15:26:46 ERROR server odoo.addons.hr_training.tests.test_training_constrains:474 write ` File "/mnt/vdb/odoo/addons_runbot/runbot/static/build/09143-1244-538c35/addons/popup_reminder/models/popup_reminder.py", line 32, in create
2019-03-13 15:26:46 ERROR server odoo.addons.hr_training.tests.test_training_constrains:474 write ` record_id = create_original(self, vals)
2019-03-13 15:26:46 ERROR server odoo.addons.hr_training.tests.test_training_constrains:474 write ` File "/opt/odoo/odoo11/odoo/models.py", line 3372, in create
2019-03-13 15:26:46 ERROR server odoo.addons.hr_training.tests.test_training_constrains:474 write ` record = self.browse(self._create(old_vals))
2019-03-13 15:26:46 ERROR server odoo.addons.hr_training.tests.test_training_constrains:474 write ` File "/opt/odoo/odoo11/odoo/models.py", line 3525, in _create
2019-03-13 15:26:46 ERROR server odoo.addons.hr_training.tests.test_training_constrains:474 write ` self._validate_fields(vals)
2019-03-13 15:26:46 ERROR server odoo.addons.hr_training.tests.test_training_constrains:474 write ` File "/opt/odoo/odoo11/odoo/models.py", line 1036, in _validate_fields
2019-03-13 15:26:46 ERROR server odoo.addons.hr_training.tests.test_training_constrains:474 write ` check(self)
2019-03-13 15:26:46 ERROR server odoo.addons.hr_training.tests.test_training_constrains:474 write ` File "/mnt/vdb/odoo/addons_runbot/runbot/static/build/09143-1244-538c35/addons/hr_training/models/hr_training.py", line 80, in _check_order_chek_date
2019-03-13 15:26:46 ERROR server odoo.addons.hr_training.tests.test_training_constrains:474 write ` raise ValidationError(_(" تاريخ التدريب يجب أن يكون أكبر من تاريخ اليوم"))
2019-03-13 15:26:46 ERROR server odoo.addons.hr_training.tests.test_training_constrains:474 write ` odoo.exceptions.ValidationError: (' تاريخ التدريب يجب أن يكون أكبر من تاريخ اليوم', None)
2019-03-13 15:26:46 ERROR server odoo.addons.hr_training.tests.test_training_constrains:474 write FAILED
2019-03-13 15:26:46 ERROR server odoo.modules.module:518 run_unit_tests Module hr_training: 0 failures, 1 errors
2019-03-13 15:26:56 INFO server odoo.modules.module:515 run_unit_tests odoo.addons.hr_training.tests.test_training_flow tested in 10.22s, 4683 queries
2019-03-13 15:27:25 INFO server odoo.modules.module:515 run_unit_tests odoo.addons.project_maintenance.tests.test_project_maintenance_flow tested in 11.21s, 6309 queries
2019-03-13 15:28:17 WARNING server odoo.models:3369 create hr.designation.type.create() includes unknown fields: direct_manager, interview_manager, personnel_hr, recruitment_manager, recrutment_decider
2019-03-13 15:28:18 WARNING server odoo.models:3369 create hr.designation.type.create() includes unknown fields: direct_manager, interview_manager, personnel_hr, recruitment_manager, recrutment_decider
2019-03-13 15:28:18 WARNING server odoo.models:3369 create hr.designation.type.create() includes unknown fields: direct_manager, interview_manager, personnel_hr, recruitment_manager, recrutment_decider
2019-03-13 15:28:18 WARNING server odoo.models:3369 create hr.designation.type.create() includes unknown fields: direct_manager, interview_manager, ministry_civil, personnel_hr, recruitment_manager, recrutment_decider
2019-03-13 15:28:18 WARNING server odoo.models:3369 create hr.designation.type.create() includes unknown fields: direct_manager, recrutment_decider
2019-03-13 15:28:40 ERROR server odoo.sql_db:235 execute
bad query: b'INSERT INTO "hr_deputation" ("id", "date_to", "seq_number", "duration", "is_need_visa", "has_direct_action", "city_id", "reservation_mail_sent", "ticket_reserved", "country_id", "need_fees", "task_name", "order_date", "transportation_type", "salary_grid_type_id", "deputation_type", "date_from", "active", "state", "department_inter_id", "transport_allowance", "deputation_balance_override", "employee_id", "type", "flight_class", "the_availability", "allowance_bonus", "create_uid", "write_uid", "create_date", "write_date") VALUES(nextval(\'hr_deputation_id_seq\'), \'2017-04-09\', \'DR001\', 6, false, false, 1, false, false, 192, false, \'\xd9\x85\xd9\x87\xd9\x85\xd8\xa9 1\', \'2019-03-13\', \'air_travel\', NULL, 1, \'2017-04-04\', true, \'draft\', 26, false, false, 35, \'internal\', \'business\', \'nothing\', false, 165, 165, (now() at time zone \'UTC\'), (now() at time zone \'UTC\')) RETURNING id'
ERROR: null value in column "salary_grid_type_id" violates not-null constraint
DETAIL:  Failing row contains (20, null, DR001, 2019-03-13, 35, null, null, null, 192, null, null, null, null, 26, 1, null, null, 2017-04-04, 2017-04-09, null, f, f, nothing, air_travel, internal, draft, مهمة 1, 6, null, 1, f, null, null, null, null, null, null, f, null, null, null, null, null, null, null, f, null, null, t, null, null, f, business, null, null, null, null, null, f, null, null, null, f, 165, 2019-03-13 15:28:39.398353, 165, 2019-03-13 15:28:39.398353).
2019-03-13 15:28:41 ERROR server odoo.addons.hr_holidays_deputation.tests.test_deputation_holiday_flow:474 write ERROR
2019-03-13 15:28:41 ERROR server odoo.addons.hr_holidays_deputation.tests.test_deputation_holiday_flow:474 write ERROR: test_deputation_request_flow (odoo.addons.hr_holidays_deputation.tests.test_deputation_holiday_flow.TestDeputationHolidayFlow)
2019-03-13 15:28:41 ERROR server odoo.addons.hr_holidays_deputation.tests.test_deputation_holiday_flow:474 write Traceback (most recent call last):
2019-03-13 15:28:41 ERROR server odoo.addons.hr_holidays_deputation.tests.test_deputation_holiday_flow:474 write ` File "/mnt/vdb/odoo/addons_runbot/runbot/static/build/09143-1244-538c35/addons/hr_holidays_deputation/tests/test_deputation_holiday_flow.py", line 25, in test_deputation_request_flow
2019-03-13 15:28:41 ERROR server odoo.addons.hr_holidays_deputation.tests.test_deputation_holiday_flow:474 write ` 'state': 'draft'})
2019-03-13 15:28:41 ERROR server odoo.addons.hr_holidays_deputation.tests.test_deputation_holiday_flow:474 write ` File "/mnt/vdb/odoo/addons_runbot/runbot/static/build/09143-1244-538c35/addons/hr_deputation/models/hr_deputation.py", line 184, in create
2019-03-13 15:28:41 ERROR server odoo.addons.hr_holidays_deputation.tests.test_deputation_holiday_flow:474 write ` res = super(HrDeputation, self).create(vals)
2019-03-13 15:28:41 ERROR server odoo.addons.hr_holidays_deputation.tests.test_deputation_holiday_flow:474 write ` File "/opt/odoo/odoo11/addons/mail/models/mail_thread.py", line 236, in create
2019-03-13 15:28:41 ERROR server odoo.addons.hr_holidays_deputation.tests.test_deputation_holiday_flow:474 write ` thread = super(MailThread, self).create(values)
2019-03-13 15:28:41 ERROR server odoo.addons.hr_holidays_deputation.tests.test_deputation_holiday_flow:474 write ` File "/mnt/vdb/odoo/addons_runbot/runbot/static/build/09143-1244-538c35/addons/popup_reminder/models/popup_reminder.py", line 32, in create
2019-03-13 15:28:41 ERROR server odoo.addons.hr_holidays_deputation.tests.test_deputation_holiday_flow:474 write ` record_id = create_original(self, vals)
2019-03-13 15:28:41 ERROR server odoo.addons.hr_holidays_deputation.tests.test_deputation_holiday_flow:474 write ` File "/opt/odoo/odoo11/odoo/models.py", line 3372, in create
2019-03-13 15:28:41 ERROR server odoo.addons.hr_holidays_deputation.tests.test_deputation_holiday_flow:474 write ` record = self.browse(self._create(old_vals))
2019-03-13 15:28:41 ERROR server odoo.addons.hr_holidays_deputation.tests.test_deputation_holiday_flow:474 write ` File "/opt/odoo/odoo11/odoo/models.py", line 3465, in _create
2019-03-13 15:28:41 ERROR server odoo.addons.hr_holidays_deputation.tests.test_deputation_holiday_flow:474 write ` cr.execute(query, tuple(u[2] for u in updates if len(u) > 2))
2019-03-13 15:28:41 ERROR server odoo.addons.hr_holidays_deputation.tests.test_deputation_holiday_flow:474 write ` File "/opt/odoo/odoo11/odoo/sql_db.py", line 155, in wrapper
2019-03-13 15:28:41 ERROR server odoo.addons.hr_holidays_deputation.tests.test_deputation_holiday_flow:474 write ` return f(self, *args, **kwargs)
2019-03-13 15:28:41 ERROR server odoo.addons.hr_holidays_deputation.tests.test_deputation_holiday_flow:474 write ` File "/opt/odoo/odoo11/odoo/sql_db.py", line 232, in execute
2019-03-13 15:28:41 ERROR server odoo.addons.hr_holidays_deputation.tests.test_deputation_holiday_flow:474 write ` res = self._obj.execute(query, params)
2019-03-13 15:28:41 ERROR server odoo.addons.hr_holidays_deputation.tests.test_deputation_holiday_flow:474 write ` psycopg2.IntegrityError: null value in column "salary_grid_type_id" violates not-null constraint
2019-03-13 15:28:41 ERROR server odoo.addons.hr_holidays_deputation.tests.test_deputation_holiday_flow:474 write ` DETAIL: Failing row contains (20, null, DR001, 2019-03-13, 35, null, null, null, 192, null, null, null, null, 26, 1, null, null, 2017-04-04, 2017-04-09, null, f, f, nothing, air_travel, internal, draft, مهمة 1, 6, null, 1, f, null, null, null, null, null, null, f, null, null, null, null, null, null, null, f, null, null, t, null, null, f, business, null, null, null, null, null, f, null, null, null, f, 165, 2019-03-13 15:28:39.398353, 165, 2019-03-13 15:28:39.398353).
2019-03-13 15:28:41 ERROR server odoo.addons.hr_holidays_deputation.tests.test_deputation_holiday_flow:474 write `
2019-03-13 15:28:41 ERROR server odoo.addons.hr_holidays_deputation.tests.test_deputation_holiday_flow:474 write FAILED
2019-03-13 15:28:41 ERROR server odoo.modules.module:518 run_unit_tests Module hr_holidays_deputation: 0 failures, 1 errors
2019-03-13 15:30:02 INFO server odoo.modules.loading:234 load_module_graph 170 modules loaded in 873.73s, 172742 queries
2019-03-13 15:30:20 INFO server odoo.modules.loading:234 load_module_graph 174 modules loaded in 17.38s, 11 queries
2019-03-13 15:30:21 ERROR server odoo.modules.loading:471 load_modules At least one test failed when loading the modules.
2019-03-13 15:30:31 INFO server odoo.modules.module:515 run_unit_tests odoo.addons.base.tests.test_reports tested in 9.31s, 1054 queries
2019-03-13 15:30:41 INFO server odoo.modules.module:515 run_unit_tests odoo.addons.account.tests.test_account_invoice_rounding tested in 5.21s, 4181 queries
2019-03-13 15:31:02 INFO server odoo.modules.module:515 run_unit_tests odoo.addons.account.tests.test_payment tested in 16.27s, 14469 queries
2019-03-13 15:31:43 INFO server odoo.modules.module:515 run_unit_tests odoo.addons.account.tests.test_reconciliation tested in 40.04s, 37487 queries
2019-03-13 15:31:51 INFO server odoo.modules.module:515 run_unit_tests odoo.addons.account.tests.test_tax tested in 6.06s, 5453 queries
2019-03-13 15:31:56 INFO server odoo.addons.website.tests.test_crawl:73 test_10_crawl_public public crawled 1 urls in 4.72s 410 queries, 4.723s 410.00q per request,
2019-03-13 15:32:27 INFO server odoo.addons.website.tests.test_crawl:83 test_20_crawl_demo demo crawled 60 urls in 30.74s 24091 queries, 0.512s 401.52q per request
2019-03-13 15:33:01 INFO server odoo.addons.website.tests.test_crawl:93 test_30_crawl_admin admin crawled 76 urls in 34.12s 27490 queries, 0.449s 361.71q per request
2019-03-13 15:33:01 INFO server odoo.modules.module:515 run_unit_tests odoo.addons.website.tests.test_crawl tested in 69.65s, 52013 queries
2019-03-13 15:33:05 INFO runbot run Start running build 09143-1244-538c35
2019-03-13 15:33:07 INFO server odoo.modules.loading:234 load_module_graph 1 modules loaded in 0.25s, 0 queries
2019-03-13 15:33:09 INFO server odoo.modules.loading:234 load_module_graph 174 modules loaded in 1.10s, 0 queries
2019-03-13 17:56:32 INFO runbot _ask_kill Killing build 09143-1244-538c35, requested by Administrator (user #1)
2019-03-13 17:58:12 INFO runbot kill Kill build 09143-1244-538c35