Subject: [FIX]Add config for this feature
Author: iboussetta
Committer: iboussetta

Date Level Type Message
2019-03-12 14:10:35 INFO runbot init Init build environment
2019-03-12 14:10:50 INFO runbot test_all Start test all modules
2019-03-12 14:11:48 INFO server odoo.modules.module:515 run_unit_tests odoo.addons.base.tests.test_translate tested in 8.67s, 25627 queries
2019-03-12 14:11:53 INFO server odoo.modules.loading:234 load_module_graph 1 modules loaded in 56.87s, 48249 queries
2019-03-12 14:12:15 INFO server odoo.modules.module:515 run_unit_tests odoo.addons.base_import.tests.test_base_import tested in 9.55s, 232 queries
2019-03-12 14:13:20 INFO server odoo.modules.module:515 run_unit_tests odoo.addons.calendar.tests.test_calendar tested in 6.80s, 5834 queries
2019-03-12 14:13:32 INFO server odoo.modules.module:515 run_unit_tests odoo.addons.event.tests.test_event_flow tested in 5.15s, 4300 queries
2019-03-12 14:14:37 INFO server odoo.modules.module:515 run_unit_tests odoo.addons.product.tests.test_variants tested in 7.29s, 7979 queries
2019-03-12 14:15:47 INFO server odoo.modules.module:515 run_unit_tests odoo.addons.crm.tests.test_crm_lead tested in 8.41s, 6720 queries
2019-03-12 14:15:56 INFO server odoo.modules.module:515 run_unit_tests odoo.addons.crm.tests.test_lead2opportunity tested in 8.48s, 6741 queries
2019-03-12 14:16:23 INFO server odoo.modules.module:515 run_unit_tests odoo.addons.hr_holidays.tests.test_holidays_flow tested in 10.98s, 5540 queries
2019-03-12 14:17:11 INFO server odoo.modules.module:515 run_unit_tests odoo.addons.project.tests.test_access_rights tested in 6.97s, 5165 queries
2019-03-12 14:17:22 ERROR server odoo.addons.user_profile.tests.test_user_profile:474 write FAIL
2019-03-12 14:17:22 ERROR server odoo.addons.user_profile.tests.test_user_profile:474 write FAIL: test_user_profile (odoo.addons.user_profile.tests.test_user_profile.UserProfileCommon)
2019-03-12 14:17:22 ERROR server odoo.addons.user_profile.tests.test_user_profile:474 write ` Checking the process of create user sing profile.
2019-03-12 14:17:22 ERROR server odoo.addons.user_profile.tests.test_user_profile:474 write Traceback (most recent call last):
2019-03-12 14:17:22 ERROR server odoo.addons.user_profile.tests.test_user_profile:474 write ` File "/mnt/vdb/odoo/addons_runbot/runbot/static/build/09110-1225-997516/addons/user_profile/tests/test_user_profile.py", line 45, in test_user_profile
2019-03-12 14:17:22 ERROR server odoo.addons.user_profile.tests.test_user_profile:474 write ` self.assertEqual(len(emails), 1, "System should send mail to simple@hadooc.com")
2019-03-12 14:17:22 ERROR server odoo.addons.user_profile.tests.test_user_profile:474 write ` AssertionError: 0 != 1 : System should send mail to simple@hadooc.com
2019-03-12 14:17:22 ERROR server odoo.addons.user_profile.tests.test_user_profile:474 write FAILED
2019-03-12 14:17:22 ERROR server odoo.modules.module:518 run_unit_tests Module user_profile: 1 failures, 0 errors
2019-03-12 14:18:39 INFO server odoo.modules.module:515 run_unit_tests odoo.addons.hr_payroll.tests.test_payslip_flow tested in 5.93s, 1120 queries
2019-03-12 14:19:11 INFO server odoo.modules.module:515 run_unit_tests odoo.addons.survey.tests.test_survey tested in 14.41s, 11746 queries
2019-03-12 14:20:11 INFO server odoo.modules.module:515 run_unit_tests odoo.addons.purchase_request.tests.test_purchase_flow tested in 10.81s, 3386 queries
2019-03-12 14:20:39 INFO server odoo.modules.module:515 run_unit_tests odoo.addons.website_forum.tests.test_forum tested in 5.80s, 4717 queries
2019-03-12 14:21:24 INFO server odoo.modules.module:515 run_unit_tests odoo.addons.hr_attendance_extend.tests.test_authorization_flow tested in 5.32s, 1302 queries
2019-03-12 14:21:51 INFO server odoo.modules.module:515 run_unit_tests odoo.addons.hr_deputation.tests.test_deputation_flow tested in 11.58s, 4024 queries
2019-03-12 14:22:20 INFO server odoo.modules.module:515 run_unit_tests odoo.addons.hr_holidays_extend.tests.test_holidays_flow tested in 14.11s, 6983 queries
2019-03-12 14:22:48 ERROR server odoo.addons.hr_training.tests.test_training_constrains:474 write ERROR
2019-03-12 14:22:48 ERROR server odoo.addons.hr_training.tests.test_training_constrains:474 write ERROR: test_training_constrains (odoo.addons.hr_training.tests.test_training_constrains.TestTrainingConstrains)
2019-03-12 14:22:48 ERROR server odoo.addons.hr_training.tests.test_training_constrains:474 write ` Test Training constraint.
2019-03-12 14:22:48 ERROR server odoo.addons.hr_training.tests.test_training_constrains:474 write Traceback (most recent call last):
2019-03-12 14:22:48 ERROR server odoo.addons.hr_training.tests.test_training_constrains:474 write ` File "/mnt/vdb/odoo/addons_runbot/runbot/static/build/09110-1225-997516/addons/hr_training/tests/test_training_constrains.py", line 76, in test_training_constrains
2019-03-12 14:22:48 ERROR server odoo.addons.hr_training.tests.test_training_constrains:474 write ` 'published': True})
2019-03-12 14:22:48 ERROR server odoo.addons.hr_training.tests.test_training_constrains:474 write ` File "/mnt/vdb/odoo/addons_runbot/runbot/static/build/09110-1225-997516/addons/hr_training/models/hr_training.py", line 50, in create
2019-03-12 14:22:48 ERROR server odoo.addons.hr_training.tests.test_training_constrains:474 write ` return super(HrTraining, self).create(vals)
2019-03-12 14:22:48 ERROR server odoo.addons.hr_training.tests.test_training_constrains:474 write ` File "/opt/odoo/odoo11/addons/mail/models/mail_thread.py", line 236, in create
2019-03-12 14:22:48 ERROR server odoo.addons.hr_training.tests.test_training_constrains:474 write ` thread = super(MailThread, self).create(values)
2019-03-12 14:22:48 ERROR server odoo.addons.hr_training.tests.test_training_constrains:474 write ` File "/mnt/vdb/odoo/addons_runbot/runbot/static/build/09110-1225-997516/addons/popup_reminder/models/popup_reminder.py", line 32, in create
2019-03-12 14:22:48 ERROR server odoo.addons.hr_training.tests.test_training_constrains:474 write ` record_id = create_original(self, vals)
2019-03-12 14:22:48 ERROR server odoo.addons.hr_training.tests.test_training_constrains:474 write ` File "/opt/odoo/odoo11/odoo/models.py", line 3372, in create
2019-03-12 14:22:48 ERROR server odoo.addons.hr_training.tests.test_training_constrains:474 write ` record = self.browse(self._create(old_vals))
2019-03-12 14:22:48 ERROR server odoo.addons.hr_training.tests.test_training_constrains:474 write ` File "/opt/odoo/odoo11/odoo/models.py", line 3525, in _create
2019-03-12 14:22:48 ERROR server odoo.addons.hr_training.tests.test_training_constrains:474 write ` self._validate_fields(vals)
2019-03-12 14:22:48 ERROR server odoo.addons.hr_training.tests.test_training_constrains:474 write ` File "/opt/odoo/odoo11/odoo/models.py", line 1036, in _validate_fields
2019-03-12 14:22:48 ERROR server odoo.addons.hr_training.tests.test_training_constrains:474 write ` check(self)
2019-03-12 14:22:48 ERROR server odoo.addons.hr_training.tests.test_training_constrains:474 write ` File "/mnt/vdb/odoo/addons_runbot/runbot/static/build/09110-1225-997516/addons/hr_training/models/hr_training.py", line 80, in _check_order_chek_date
2019-03-12 14:22:48 ERROR server odoo.addons.hr_training.tests.test_training_constrains:474 write ` raise ValidationError(_(" تاريخ التدريب يجب أن يكون أكبر من تاريخ اليوم"))
2019-03-12 14:22:48 ERROR server odoo.addons.hr_training.tests.test_training_constrains:474 write ` odoo.exceptions.ValidationError: (' تاريخ التدريب يجب أن يكون أكبر من تاريخ اليوم', None)
2019-03-12 14:22:48 ERROR server odoo.addons.hr_training.tests.test_training_constrains:474 write FAILED
2019-03-12 14:22:48 ERROR server odoo.modules.module:518 run_unit_tests Module hr_training: 0 failures, 1 errors
2019-03-12 14:22:58 INFO server odoo.modules.module:515 run_unit_tests odoo.addons.hr_training.tests.test_training_flow tested in 9.95s, 4683 queries
2019-03-12 14:23:27 INFO server odoo.modules.module:515 run_unit_tests odoo.addons.project_maintenance.tests.test_project_maintenance_flow tested in 11.59s, 6309 queries
2019-03-12 14:25:49 INFO server odoo.modules.loading:234 load_module_graph 169 modules loaded in 832.28s, 171840 queries
2019-03-12 14:26:08 INFO server odoo.modules.loading:234 load_module_graph 173 modules loaded in 19.18s, 11 queries
2019-03-12 14:26:09 ERROR server odoo.modules.loading:471 load_modules At least one test failed when loading the modules.
2019-03-12 14:26:19 INFO server odoo.modules.module:515 run_unit_tests odoo.addons.base.tests.test_reports tested in 9.76s, 1057 queries
2019-03-12 14:26:31 INFO server odoo.modules.module:515 run_unit_tests odoo.addons.account.tests.test_account_invoice_rounding tested in 5.60s, 4193 queries
2019-03-12 14:26:51 INFO server odoo.modules.module:515 run_unit_tests odoo.addons.account.tests.test_payment tested in 15.31s, 14433 queries
2019-03-12 14:27:31 INFO server odoo.modules.module:515 run_unit_tests odoo.addons.account.tests.test_reconciliation tested in 38.88s, 37261 queries
2019-03-12 14:27:40 INFO server odoo.modules.module:515 run_unit_tests odoo.addons.account.tests.test_tax tested in 6.57s, 5425 queries
2019-03-12 14:27:45 INFO server odoo.addons.website.tests.test_crawl:73 test_10_crawl_public public crawled 1 urls in 4.36s 410 queries, 4.358s 410.00q per request,
2019-03-12 14:28:14 INFO server odoo.addons.website.tests.test_crawl:83 test_20_crawl_demo demo crawled 60 urls in 29.12s 24091 queries, 0.485s 401.52q per request
2019-03-12 14:28:47 INFO server odoo.addons.website.tests.test_crawl:93 test_30_crawl_admin admin crawled 76 urls in 33.12s 27486 queries, 0.436s 361.66q per request
2019-03-12 14:28:47 INFO server odoo.modules.module:515 run_unit_tests odoo.addons.website.tests.test_crawl tested in 66.65s, 52009 queries
2019-03-12 14:28:59 INFO runbot run Start running build 09110-1225-997516
2019-03-12 14:29:08 INFO server odoo.modules.loading:234 load_module_graph 1 modules loaded in 0.24s, 0 queries
2019-03-12 14:29:09 INFO server odoo.modules.loading:234 load_module_graph 173 modules loaded in 1.02s, 0 queries
2019-03-13 19:13:55 INFO runbot kill Kill build 09110-1225-997516